{"text_format":"3","workbook":"xlsx","n_sheets":5,"sheets":["Cash-Flow-DATA","OTCHET-agregirani pokazateli","OTCHET","list","INF"],"not_rendered":{"macros":1,"defined_names":14,"comments":5},"read":"whole","date_system":"1900"}

{"sheet":"Cash-Flow-DATA","index":0,"n_rows":141,"n_cols":20,"rows_kept":141,"merged":[[1,1,1,3],[1,8,1,9],[1,11,1,13],[1,19,1,20],[3,18,3,20],[5,18,5,20],[7,18,7,20],[8,18,8,20],[12,18,12,20],[13,18,13,20],[14,18,14,20],[15,18,15,20],[16,18,16,20],[17,18,17,20],[18,18,18,20],[19,18,19,20],[20,18,20,20],[21,18,21,20],[22,18,22,20],[24,18,24,20],[25,18,25,20],[26,18,26,20],[27,18,27,20],[34,18,34,20],[35,18,35,20],[36,18,36,20],[37,18,37,20],[39,18,39,20],[41,18,41,20],[42,18,42,20],[43,18,43,20],[44,18,44,20],[45,18,45,20],[47,18,47,20],[50,18,50,20],[51,18,51,20],[52,18,52,20],[53,18,53,20],[54,18,54,20],[55,18,55,20],[57,18,57,20],[58,18,58,20],[59,18,59,20],[60,18,60,20],[62,18,62,20],[64,18,64,20],[65,18,65,20],[66,18,66,20],[68,18,68,20],[69,18,69,20],[70,18,70,20],[72,18,72,20],[73,18,73,20],[74,18,74,20],[76,18,76,20],[78,18,78,20],[79,18,79,20],[80,18,80,20],[81,1,81,3],[86,18,86,20],[87,18,87,20],[88,18,88,20],[90,18,90,20],[91,18,91,20],[92,18,92,20],[93,18,93,20],[94,18,94,20],[96,18,96,20],[97,18,97,20],[98,18,98,20],[100,18,100,20],[103,18,103,20],[104,18,104,20],[105,18,105,20],[107,18,107,20],[108,18,108,20],[109,18,109,20],[111,18,111,20],[112,18,112,20],[113,18,113,20],[115,18,115,20],[116,18,116,20],[117,18,117,20],[119,18,119,20],[121,18,121,20],[123,18,123,20],[125,18,125,20],[126,18,126,20],[128,18,128,20],[129,18,129,20],[130,18,130,20],[131,18,131,20],[132,1,132,3],[133,5,133,6],[133,11,133,13],[133,15,133,16]]}
[null," (бюджетна организация, предприятие по чл. 165, ал. 1 от ЗПФ, поделение)",{"$nulls":3},"ЕИК/БУЛСТАТ","код по ЕБК",null,"                    Web-адрес",null,null,"e-mail",{"$nulls":3},"      финансово-правна форма"]
[null,{"$f":"+OTCHET!B9","v":"ДЕТСКА ГРАДИНА \"НАРЦИС\""},{"$nulls":3},{"$f":"+OTCHET!H9","v":{"v":0,"d":"000 000 000"}},{"$f":"+OTCHET!F12","v":"6905"},null,{"$f":"+OTCHET!H607","v":{"v":0,"d":"0 0 0 0"}},null,null,{"$f":"OTCHET!H605","v":"odz_narcis@abv.bg"},{"$nulls":3},{"$f":"OTCHET!E15","v":98},{"$f":"OTCHET!F15","v":"СЕС - КСФ"},null,"                           код от регистъра на бюджетните организации в СЕБРА",{"$f":"+OTCHET!I9","v":0}]
[]
[null,"                                                               ИНФОРМАЦИЯ ЗА ИЗГОТВЯНЕ НА  ОТЧЕТ ЗА КАСОВОТО ИЗПЪЛНЕНИЕ ",{"$nulls":7},"ГОДИНА",null,{"$f":"+Q4","v":{"v":2020,"d":"2 0 2 0"}},{"$nulls":3},"ГОДИНА",{"$f":"+OTCHET!C3","v":{"v":2020,"d":"2 0 2 0"}},null,"ОТЧЕТ ЗА КАСОВОТО ИЗПЪЛНЕНИЕ НА БЮДЖЕТА, СМЕТКИТЕ ЗА СЕС И ЧУЖДИТЕ СРЕДСТВА"]
[]
[null,"                       НА БЮДЖЕТА, СМЕТКИТЕ ЗА СРЕДСТВАТА ОТ ЕВРОПЕЙСКИЯ СЪЮЗ И СМЕТКИТЕ ЗА ЧУЖДИ СРЕДСТВА КЪМ",{"$nulls":9},{"$f":"OTCHET!F9","v":"2020-06-30"},null,"(В ЛЕВОВЕ)",null,{"$f":"OTCHET!F9","v":"2020-06-30"},"(В ЛЕВОВЕ)",null,{"$f":"+Q4","v":{"v":2020,"d":"МАКЕТ ЗА 2020 г."}}]
[]
[{"$nulls":5},"БЮДЖЕТ Годишен         уточнен план                           ","БЮДЖЕТ -ОТЧЕТ  ",null,"Сметки за сред-ства от Европей-ския съюз-инди-кативни разчети                      ","Сметки за сред-ства от Евро-пейския съюз - ОТЧЕТ",null,"Сметки за чуж-ди средства - ОТЧЕТ                ",null,"ОБЩО КАСОВ ОТЧЕТ  ",null,"таблица            'OTCHET'         Год. уточнен план                           ","таблица 'OTCHET'  ОТЧЕТ",null,"§§ от ЕБК, които се включват в съответния показател"]
[null,"                                  П О К А З А Т Е Л И",{"$nulls":3},{"$f":"+L4","v":{"v":2020,"d":"за 2020 г."}},{"$f":"+L6","v":"2020-06-30"},null,{"$f":"+L4","v":{"v":2020,"d":"за 2020 г."}},{"$f":"+L6","v":"2020-06-30"},null,{"$f":"+L6","v":"2020-06-30"},null,{"$f":"+L6","v":"2020-06-30"},null,{"$f":"+L4","v":{"v":2020,"d":"за 2020 г."}},{"$f":"+L6","v":"2020-06-30"},null,"П О К А З А Т Е Л И"]
[null,"                                                                (а)",{"$nulls":3},"(1)","(2)",null,"(3)","(4)",null,"(5)",null,"(6)=(2)+(4)+(5)",null,"(1)","(2)"]
[null," А. ПРИХОДИ, ПОМОЩИ И ДАРЕНИЯ",{"$nulls":16}," А. ПРИХОДИ, ПОМОЩИ И ДАРЕНИЯ"]
[null," I. Постъпления от текущи приходи",{"$nulls":16}," I. Постъпления от текущи приходи"]
[null," 1. Приходи от данъци и осигурителни вноски",{"$nulls":3},{"$f":"+IF($P$2=0,$P13,0)","v":{"v":0,"d":"0 "}},{"$f":"+IF($P$2=0,$Q13,0)","v":{"v":0,"d":"0 "}},null,{"$f":"+IF(OR($P$2=98,$P$2=42,$P$2=96,$P$2=97),$P13,0)","v":{"v":0,"d":"0 "}},{"$f":"+IF(OR($P$2=98,$P$2=42,$P$2=96,$P$2=97),$Q13,0)","v":{"v":0,"d":"0 "}},null,{"$f":"+IF($P$2=33,$Q13,0)","v":{"v":0,"d":"0 "}},null,{"$f":"+ROUND(+G13+J13+L13,0)","v":{"v":0,"d":"0 "}},null,{"$f":"+ROUND(OTCHET!E22+OTCHET!E28+OTCHET!E33+OTCHET!E39+OTCHET!E47+OTCHET!E52+OTCHET!E58+OTCHET!E61+OTCHET!E64+OTCHET!E65+OTCHET!E72+OTCHET!E73,0)","v":{"v":0,"d":"0 "}},{"$f":"+ROUND(OTCHET!L22+OTCHET!L28+OTCHET!L33+OTCHET!L39+OTCHET!L47+OTCHET!L52+OTCHET!L58+OTCHET!L61+OTCHET!L64+OTCHET!L65+OTCHET!L72+OTCHET!L73,0)","v":{"v":0,"d":"0 "}},null,"приходни §§ 01-00 ÷ 20-00"]
[null," 2. Приходи от такси и вноски",{"$nulls":3},{"$f":"+IF($P$2=0,$P14,0)","v":{"v":0,"d":"0 "}},{"$f":"+IF($P$2=0,$Q14,0)","v":{"v":0,"d":"0 "}},null,{"$f":"+IF(OR($P$2=98,$P$2=42,$P$2=96,$P$2=97),$P14,0)","v":{"v":0,"d":"0 "}},{"$f":"+IF(OR($P$2=98,$P$2=42,$P$2=96,$P$2=97),$Q14,0)","v":{"v":0,"d":"0 "}},null,{"$f":"+IF($P$2=33,$Q14,0)","v":{"v":0,"d":"0 "}},null,{"$f":"+ROUND(+G14+J14+L14,0)","v":{"v":0,"d":"0 "}},null,{"$f":"+ROUND(+OTCHET!E90+OTCHET!E93+OTCHET!E94+OTCHET!E115+OTCHET!E116,0)","v":{"v":0,"d":"0 "}},{"$f":"+ROUND(+OTCHET!L90+OTCHET!L93+OTCHET!L94+OTCHET!L115+OTCHET!L116,0)","v":{"v":0,"d":"0 "}},null,"приходни §§ 25-00, 26-00, 27-00, 36-08 и 36-10"]
[null,"    в т.ч.  приходи от вноски",{"$nulls":3},{"$f":"+IF($P$2=0,$P15,0)","v":{"v":0,"d":"0 "}},{"$f":"+IF($P$2=0,$Q15,0)","v":{"v":0,"d":"0 "}},null,{"$f":"+IF(OR($P$2=98,$P$2=42,$P$2=96,$P$2=97),$P15,0)","v":{"v":0,"d":"0 "}},{"$f":"+IF(OR($P$2=98,$P$2=42,$P$2=96,$P$2=97),$Q15,0)","v":{"v":0,"d":"0 "}},null,{"$f":"+IF($P$2=33,$Q15,0)","v":{"v":0,"d":"0 "}},null,{"$f":"+ROUND(+G15+J15+L15,0)","v":{"v":0,"d":"0 "}},null,{"$f":"+ROUND(+OTCHET!E115+OTCHET!E116,0)","v":{"v":0,"d":"0 "}},{"$f":"+OTCHET!L115+OTCHET!L116","v":{"v":0,"d":"0 "}},null,"приходни §§ 36-08 и 36-10"]
[null," 3. Приходи от административни глоби, санкции и наказателни лихви",{"$nulls":3},{"v":0,"d":"0 "},{"v":0,"d":"0 "},null,{"v":0,"d":"0 "},{"v":0,"d":"0 "},null,{"v":0,"d":"0 "},null,{"v":0,"d":"0 "},null,{"$f":"+ROUND(+OTCHET!E110+OTCHET!E111,0)","v":{"v":0,"d":"0 "}},{"$f":"+ROUND(+OTCHET!L110+OTCHET!L111,0)","v":{"v":0,"d":"0 "}},null,"приходни §§ 28-02 и 28-09"]
[null," 4. Нетни приходи от продажби на услуги, стоки и продукция",{"$nulls":3},{"v":0,"d":"0 "},{"v":0,"d":"0 "},null,{"v":0,"d":"0 "},{"v":0,"d":"0 "},null,{"v":0,"d":"0 "},null,{"v":0,"d":"0 "},null,{"$f":"+ROUND(OTCHET!E77,0)","v":{"v":0,"d":"0 "}},{"$f":"+ROUND(OTCHET!L77,0)","v":{"v":0,"d":"0 "}},null,"приходeн § 24-04"]
[null," 5. Приходи от наеми",{"$nulls":3},{"v":0,"d":"0 "},{"v":0,"d":"0 "},null,{"v":0,"d":"0 "},{"v":0,"d":"0 "},null,{"v":0,"d":"0 "},null,{"v":0,"d":"0 "},null,{"$f":"+ROUND(OTCHET!E78+OTCHET!E79,0)","v":{"v":0,"d":"0 "}},{"$f":"+ROUND(OTCHET!L78+OTCHET!L79,0)","v":{"v":0,"d":"0 "}},null,"приходни §§ 24-05 и 24-06"]
[null," 6. Приходи от концесии и лицензии за ползване на публични активи",{"$nulls":3},{"v":0,"d":"0 "},{"v":0,"d":"0 "},null,{"v":0,"d":"0 "},{"v":0,"d":"0 "},null,{"v":0,"d":"0 "},null,{"v":0,"d":"0 "},null,{"$f":"+ROUND(OTCHET!E137++OTCHET!E138,0)","v":{"v":0,"d":"0 "}},{"$f":"+ROUND(OTCHET!L137++OTCHET!L138,0)","v":{"v":0,"d":"0 "}},null,"приходни §§ 41-00 и 42-00"]
[null," 7. Приходи от лихви",{"$nulls":3},{"v":0,"d":"0 "},{"v":0,"d":"0 "},null,{"v":0,"d":"0 "},{"v":0,"d":"0 "},null,{"v":0,"d":"0 "},null,{"v":0,"d":"0 "},null,{"$f":"+ROUND(+SUM(OTCHET!E81:E89),0)","v":{"v":0,"d":"0 "}},{"$f":"+ROUND(+SUM(OTCHET!L81:L89),0)","v":{"v":0,"d":"0 "}},null,"приходни §§ 24-08 ÷ 24-19"]
[null," 8. Приходи от дивиденти и дялово участие ",{"$nulls":3},{"v":0,"d":"0 "},{"v":0,"d":"0 "},null,{"v":0,"d":"0 "},{"v":0,"d":"0 "},null,{"v":0,"d":"0 "},null,{"v":0,"d":"0 "},null,{"$f":"+ROUND(OTCHET!E75+OTCHET!E76+OTCHET!E80,0)","v":{"v":0,"d":"0 "}},{"$f":"+ROUND(OTCHET!L75+OTCHET!L76+OTCHET!L80,0)","v":{"v":0,"d":"0 "}},null,"приходни §§ 24-01, 24-03 и 24-07"]
[null," 9. Други текущи приходи и реализирани курсови разлики",{"$nulls":3},{"v":0,"d":"0 "},{"v":0,"d":"0 "},null,{"v":0,"d":"0 "},{"v":0,"d":"0 "},null,{"v":0,"d":"0 "},null,{"v":0,"d":"0 "},null,{"$f":"+ROUND(OTCHET!E113+OTCHET!E114+OTCHET!E120,0)","v":{"v":0,"d":"0 "}},{"$f":"+ROUND(OTCHET!L113+OTCHET!L114+OTCHET!L120,0)","v":{"v":0,"d":"0 "}},null,"приходни §§ 36-01, 36-05 и 36-19"]
[null," Общо за група І. Постъпления от текущи приходи",{"$nulls":3},{"$f":"+ROUND(+SUM(F13,F14,F16,F17,F18,F19,F20,F21,F22),0)","v":{"v":0,"d":"0 "}},{"$f":"+ROUND(+SUM(G13,G14,G16,G17,G18,G19,G20,G21,G22),0)","v":{"v":0,"d":"0 "}},null,{"$f":"+ROUND(+SUM(I13,I14,I16,I17,I18,I19,I20,I21,I22),0)","v":{"v":0,"d":"0 "}},{"$f":"+ROUND(+SUM(J13,J14,J16,J17,J18,J19,J20,J21,J22),0)","v":{"v":0,"d":"0 "}},null,{"$f":"+ROUND(+SUM(L13,L14,L16,L17,L18,L19,L20,L21,L22),0)","v":{"v":0,"d":"0 "}},null,{"$f":"+ROUND(+SUM(N13,N14,N16,N17,N18,N19,N20,N21,N22),0)","v":{"v":0,"d":"0 "}},null,{"$f":"+ROUND(+SUM(P13,P14,P16,P17,P18,P19,P20,P21,P22),0)","v":{"v":0,"d":"0 "}},{"$f":"+ROUND(+SUM(Q13,Q14,Q16,Q17,Q18,Q19,Q20,Q21,Q22),0)","v":{"v":0,"d":"0 "}},null,"сборен ред за група І. Постъпления от текущи приходи"]
[null," IІ. Реализация на нефинансови активи и конфискувани средства",{"$nulls":16}," IІ. Реализация на нефинансови активи и конфискувани средства"]
[null," 1. Продажба на земя",{"$nulls":3},{"$f":"+IF($P$2=0,$P25,0)","v":{"v":0,"d":"0 "}},{"$f":"+IF($P$2=0,$Q25,0)","v":{"v":0,"d":"0 "}},null,{"$f":"+IF(OR($P$2=98,$P$2=42,$P$2=96,$P$2=97),$P25,0)","v":{"v":0,"d":"0 "}},{"$f":"+IF(OR($P$2=98,$P$2=42,$P$2=96,$P$2=97),$Q25,0)","v":{"v":0,"d":"0 "}},null,{"$f":"+IF($P$2=33,$Q25,0)","v":{"v":0,"d":"0 "}},null,{"$f":"+ROUND(+G25+J25+L25,0)","v":{"v":0,"d":"0 "}},null,{"$f":"+ROUND(OTCHET!E135,0)","v":{"v":0,"d":"0 "}},{"$f":"+ROUND(OTCHET!L135,0)","v":{"v":0,"d":"0 "}},null,"приходeн § 40-40"]
[null," 2. Продажба на други нефинансови дълготрайни активи",{"$nulls":3},{"$f":"+IF($P$2=0,$P26,0)","v":{"v":0,"d":"0 "}},{"$f":"+IF($P$2=0,$Q26,0)","v":{"v":0,"d":"0 "}},null,{"$f":"+IF(OR($P$2=98,$P$2=42,$P$2=96,$P$2=97),$P26,0)","v":{"v":0,"d":"0 "}},{"$f":"+IF(OR($P$2=98,$P$2=42,$P$2=96,$P$2=97),$Q26,0)","v":{"v":0,"d":"0 "}},null,{"$f":"+IF($P$2=33,$Q26,0)","v":{"v":0,"d":"0 "}},null,{"$f":"+ROUND(+G26+J26+L26,0)","v":{"v":0,"d":"0 "}},null,{"$f":"+ROUND(+SUM(OTCHET!E126:E134)+OTCHET!E136,0)","v":{"v":0,"d":"0 "}},{"$f":"+ROUND(+SUM(OTCHET!L126:L134)+OTCHET!L136,0)","v":{"v":0,"d":"0 "}},null,"приходeн § 40-00 без §§ 40-40 и 40-71"]
[null," 3. Конфиск. средства и продажби на конфискувани и от залог нефин. активи ",{"$nulls":3},{"$f":"+IF($P$2=0,$P27,0)","v":{"v":0,"d":"0 "}},{"$f":"+IF($P$2=0,$Q27,0)","v":{"v":0,"d":"0 "}},null,{"$f":"+IF(OR($P$2=98,$P$2=42,$P$2=96,$P$2=97),$P27,0)","v":{"v":0,"d":"0 "}},{"$f":"+IF(OR($P$2=98,$P$2=42,$P$2=96,$P$2=97),$Q27,0)","v":{"v":0,"d":"0 "}},null,{"$f":"+IF($P$2=33,$Q27,0)","v":{"v":0,"d":"0 "}},null,{"$f":"+ROUND(+G27+J27+L27,0)","v":{"v":0,"d":"0 "}},null,{"$f":"+ROUND(+OTCHET!E109,0)","v":{"v":0,"d":"0 "}},{"$f":"+ROUND(+OTCHET!L109,0)","v":{"v":0,"d":"0 "}},null,"приходeн § 28-01"]
[null," Общо за група ІІ. Постъпления от продажби на нефинансови активи",{"$nulls":3},{"$f":"+ROUND(+SUM(F25:F27),0)","v":{"v":0,"d":"0 "}},{"$f":"+ROUND(+SUM(G25:G27),0)","v":{"v":0,"d":"0 "}},null,{"$f":"+ROUND(+SUM(I25:I27),0)","v":{"v":0,"d":"0 "}},{"$f":"+ROUND(+SUM(J25:J27),0)","v":{"v":0,"d":"0 "}},null,{"$f":"+ROUND(+SUM(L25:L27),0)","v":{"v":0,"d":"0 "}},null,{"$f":"+ROUND(+SUM(N25:N27),0)","v":{"v":0,"d":"0 "}},null,{"$f":"+ROUND(+SUM(P25:P27),0)","v":{"v":0,"d":"0 "}},{"$f":"+ROUND(+SUM(Q25:Q27),0)","v":{"v":0,"d":"0 "}},null,"сборен ред за група ІІ. Постъпления от продажби на нефинансови активи"]
[]
[null," IІI. Внесен ДДС, др. данъци в/у продажбите и коректив за постъпления "]
[null," 1. Внесен ДДС"]
[null," 2. Внесен данък върху приходите от стопанска дейност"]
[null," 3. Внесени други данъци върху продажбите"]
[null," 4. Коректив за касови постъпления"]
[null," ІІІ. Внесен ДДС и др. данъци в/у продажбите и коректив за постъпления",{"$nulls":3},{"$f":"+IF($P$2=0,$P35,0)","v":{"v":0,"d":"0 "}},{"$f":"+IF($P$2=0,$Q35,0)","v":{"v":0,"d":"0 "}},null,{"$f":"+IF(OR($P$2=98,$P$2=42,$P$2=96,$P$2=97),$P35,0)","v":{"v":0,"d":"0 "}},{"$f":"+IF(OR($P$2=98,$P$2=42,$P$2=96,$P$2=97),$Q35,0)","v":{"v":0,"d":"0 "}},null,{"$f":"+IF($P$2=33,$Q35,0)","v":{"v":0,"d":"0 "}},null,{"$f":"+ROUND(+G35+J35+L35,0)","v":{"v":0,"d":"0 "}},null,{"$f":"+ROUND(+OTCHET!E121+OTCHET!E119,0)","v":{"v":0,"d":"0 "}},{"$f":"+ROUND(+OTCHET!L121+OTCHET!L119,0)","v":{"v":0,"d":"0 "}},null,"ІІІ. Внесен ДДС и др. д-ци в/у продажбите и коректив - приходни § 36-18 и 37-00"]
[null,"     в т. ч. внесен ДДС",{"$nulls":3},{"$f":"+IF($P$2=0,$P36,0)","v":{"v":0,"d":"0 "}},{"$f":"+IF($P$2=0,$Q36,0)","v":{"v":0,"d":"0 "}},null,{"$f":"+IF(OR($P$2=98,$P$2=42,$P$2=96,$P$2=97),$P36,0)","v":{"v":0,"d":"0 "}},{"$f":"+IF(OR($P$2=98,$P$2=42,$P$2=96,$P$2=97),$Q36,0)","v":{"v":0,"d":"0 "}},null,{"$f":"+IF($P$2=33,$Q36,0)","v":{"v":0,"d":"0 "}},null,{"v":0,"d":"0 "},null,{"$f":"+ROUND(OTCHET!E122,0)","v":{"v":0,"d":"0 "}},{"$f":"+ROUND(OTCHET!L122,0)","v":{"v":0,"d":"0 "}},null,"приходен § 37-01"]
[null,"                внесен данък в/у приходите от стопанска дейност",{"$nulls":3},{"$f":"+IF($P$2=0,$P37,0)","v":{"v":0,"d":"0 "}},{"$f":"+IF($P$2=0,$Q37,0)","v":{"v":0,"d":"0 "}},null,{"$f":"+IF(OR($P$2=98,$P$2=42,$P$2=96,$P$2=97),$P37,0)","v":{"v":0,"d":"0 "}},{"$f":"+IF(OR($P$2=98,$P$2=42,$P$2=96,$P$2=97),$Q37,0)","v":{"v":0,"d":"0 "}},null,{"$f":"+IF($P$2=33,$Q37,0)","v":{"v":0,"d":"0 "}},null,{"v":0,"d":"0 "},null,{"$f":"+ROUND(OTCHET!E123,0)","v":{"v":0,"d":"0 "}},{"$f":"+ROUND(OTCHET!L123,0)","v":{"v":0,"d":"0 "}},null,"приходен § 37-02"]
[null,"                внесени други данъци, такси и вноски в/у продажбите",{"$nulls":3},{"$f":"+IF($P$2=0,$P38,0)","v":{"v":0,"d":"0 "}},{"$f":"+IF($P$2=0,$Q38,0)","v":{"v":0,"d":"0 "}},null,{"$f":"+IF(OR($P$2=98,$P$2=42,$P$2=96,$P$2=97),$P38,0)","v":{"v":0,"d":"0 "}},{"$f":"+IF(OR($P$2=98,$P$2=42,$P$2=96,$P$2=97),$Q38,0)","v":{"v":0,"d":"0 "}},null,{"$f":"+IF($P$2=33,$Q38,0)","v":{"v":0,"d":"0 "}},null,{"v":0,"d":"0 "},null,{"$f":"+ROUND(OTCHET!E124,0)","v":{"v":0,"d":"0 "}},{"$f":"+ROUND(OTCHET!L124,0)","v":{"v":0,"d":"0 "}},null,"приходен § 37-09"]
[]
[null," IV. Постъпления от застрахователни обезщетения",{"$nulls":3},{"$f":"+IF($P$2=0,$P40,0)","v":{"v":0,"d":"0 "}},{"$f":"+IF($P$2=0,$Q40,0)","v":{"v":0,"d":"0 "}},null,{"$f":"+IF(OR($P$2=98,$P$2=42,$P$2=96,$P$2=97),$P40,0)","v":{"v":0,"d":"0 "}},{"$f":"+IF(OR($P$2=98,$P$2=42,$P$2=96,$P$2=97),$Q40,0)","v":{"v":0,"d":"0 "}},null,{"$f":"+IF($P$2=33,$Q40,0)","v":{"v":0,"d":"0 "}},null,{"v":0,"d":"0 "},null,{"$f":"+ROUND(OTCHET!E117+OTCHET!E118,0)","v":{"v":0,"d":"0 "}},{"$f":"+ROUND(OTCHET!L117+OTCHET!L118,0)","v":{"v":0,"d":"0 "}},null,"IV. Постъпления от застрахователни обезщетения - приходни § 36-11 и 36-12"]
[null," V. Приходи от помощи и дарения",{"$nulls":16}," V. Приходи от помощи и дарения"]
[null," 1. Помощи и дарения от Европейския съюз",{"$nulls":3},{"$f":"+IF($P$2=0,$P42,0)","v":{"v":0,"d":"0 "}},{"$f":"+IF($P$2=0,$Q42,0)","v":{"v":0,"d":"0 "}},null,{"$f":"+IF(OR($P$2=98,$P$2=42,$P$2=96,$P$2=97),$P42,0)","v":{"v":0,"d":"0 "}},{"$f":"+IF(OR($P$2=98,$P$2=42,$P$2=96,$P$2=97),$Q42,0)","v":{"v":0,"d":"0 "}},null,{"$f":"+IF($P$2=33,$Q42,0)","v":{"v":0,"d":"0 "}},null,{"$f":"+ROUND(+G42+J42+L42,0)","v":{"v":0,"d":"0 "}},null,{"$f":"+ROUND(OTCHET!E143+OTCHET!E144+OTCHET!E161+OTCHET!E162,0)","v":{"v":0,"d":"0 "}},{"$f":"+ROUND(OTCHET!L143+OTCHET!L144+OTCHET!L161+OTCHET!L162,0)","v":{"v":0,"d":"0 "}},null,"приходни §§ 46-10, 46-20, 48-10 и 48-20"]
[null," 2. Други помощи и дарения от чужбина",{"$nulls":3},{"$f":"+IF($P$2=0,$P43,0)","v":{"v":0,"d":"0 "}},{"$f":"+IF($P$2=0,$Q43,0)","v":{"v":0,"d":"0 "}},null,{"$f":"+IF(OR($P$2=98,$P$2=42,$P$2=96,$P$2=97),$P43,0)","v":{"v":0,"d":"0 "}},{"$f":"+IF(OR($P$2=98,$P$2=42,$P$2=96,$P$2=97),$Q43,0)","v":{"v":0,"d":"0 "}},null,{"$f":"+IF($P$2=33,$Q43,0)","v":{"v":0,"d":"0 "}},null,{"$f":"+ROUND(+G43+J43+L43,0)","v":{"v":0,"d":"0 "}},null,{"$f":"+ROUND(+SUM(OTCHET!E145:E150)+SUM(OTCHET!E163:E168),0)","v":{"v":0,"d":"0 "}},{"$f":"+ROUND(+SUM(OTCHET!L145:L150)+SUM(OTCHET!L163:L168),0)","v":{"v":0,"d":"0 "}},null,"приходни §§ 46-30 ÷ 46-80 и §§ 48-30 ÷ 48-80"]
[null," 3. Други безвъзмездно получени средства по международни и други програми",{"$nulls":3},{"$f":"+IF($P$2=0,$P44,0)","v":{"v":0,"d":"0 "}},{"$f":"+IF($P$2=0,$Q44,0)","v":{"v":0,"d":"0 "}},null,{"$f":"+IF(OR($P$2=98,$P$2=42,$P$2=96,$P$2=97),$P44,0)","v":{"v":0,"d":"0 "}},{"$f":"+IF(OR($P$2=98,$P$2=42,$P$2=96,$P$2=97),$Q44,0)","v":{"v":0,"d":"0 "}},null,{"$f":"+IF($P$2=33,$Q44,0)","v":{"v":0,"d":"0 "}},null,{"$f":"+ROUND(+G44+J44+L44,0)","v":{"v":0,"d":"0 "}},null,{"$f":"+ROUND(OTCHET!E151,0)","v":{"v":0,"d":"0 "}},{"$f":"+ROUND(OTCHET!L151,0)","v":{"v":0,"d":"0 "}},null,"приходeн § 47-00"]
[null," 4. Помощи и дарения от страната",{"$nulls":3},{"$f":"+IF($P$2=0,$P45,0)","v":{"v":0,"d":"0 "}},{"$f":"+IF($P$2=0,$Q45,0)","v":{"v":0,"d":"0 "}},null,{"$f":"+IF(OR($P$2=98,$P$2=42,$P$2=96,$P$2=97),$P45,0)","v":{"v":0,"d":"0 "}},{"$f":"+IF(OR($P$2=98,$P$2=42,$P$2=96,$P$2=97),$Q45,0)","v":{"v":0,"d":"0 "}},null,{"$f":"+IF($P$2=33,$Q45,0)","v":{"v":0,"d":"0 "}},null,{"$f":"+ROUND(+G45+J45+L45,0)","v":{"v":0,"d":"0 "}},null,{"$f":"+ROUND(OTCHET!E139,0)","v":{"v":0,"d":"0 "}},{"$f":"+ROUND(OTCHET!L139,0)","v":{"v":0,"d":"0 "}},null,"приходeн § 45-00"]
[null," Общо за група V. Приходи от помощи и дарения",{"$nulls":3},{"$f":"+ROUND(+SUM(F42:F45),0)","v":{"v":0,"d":"0 "}},{"$f":"+ROUND(+SUM(G42:G45),0)","v":{"v":0,"d":"0 "}},null,{"$f":"+ROUND(+SUM(I42:I45),0)","v":{"v":0,"d":"0 "}},{"$f":"+ROUND(+SUM(J42:J45),0)","v":{"v":0,"d":"0 "}},null,{"$f":"+ROUND(+SUM(L42:L45),0)","v":{"v":0,"d":"0 "}},null,{"$f":"+ROUND(+SUM(N42:N45),0)","v":{"v":0,"d":"0 "}},null,{"$f":"+ROUND(+SUM(P42:P45),0)","v":{"v":0,"d":"0 "}},{"$f":"+ROUND(+SUM(Q42:Q45),0)","v":{"v":0,"d":"0 "}},null,"сборен ред за група V. Приходи от помощи и дарения"]
[]
[null," А. ОБЩО ПРИХОДИ, ПОМОЩИ И ДАРЕНИЯ",{"$nulls":3},{"$f":"+ROUND(F23+F28+F35+F40+F46,0)","v":{"v":0,"d":"0 "}},{"$f":"+ROUND(G23+G28+G35+G40+G46,0)","v":{"v":0,"d":"0 "}},null,{"$f":"+ROUND(I23+I28+I35+I40+I46,0)","v":{"v":0,"d":"0 "}},{"$f":"+ROUND(J23+J28+J35+J40+J46,0)","v":{"v":0,"d":"0 "}},null,{"$f":"+ROUND(L23+L28+L35+L40+L46,0)","v":{"v":0,"d":"0 "}},null,{"$f":"+ROUND(N23+N28+N35+N40+N46,0)","v":{"v":0,"d":"0 "}},null,{"$f":"+ROUND(P23+P28+P35+P40+P46,0)","v":{"v":0,"d":"0 "}},{"$f":"+ROUND(Q23+Q28+Q35+Q40+Q46,0)","v":{"v":0,"d":"0 "}},null," сборен ред за А. ОБЩО ПРИХОДИ, ПОМОЩИ И ДАРЕНИЯ"]
[null," Б. РАЗХОДИ И ПРИДОБИВАНЕ НА НЕФИНАНСОВИ АКТИВИ",{"$nulls":16}," Б. РАЗХОДИ И ПРИДОБИВАНЕ НА НЕФИНАНСОВИ АКТИВИ"]
[null," I. Плащания за текущи нелихвени разходи",{"$nulls":16}," I. Плащания за текущи нелихвени разходи"]
[null," 1. Разходи за издръжка - нефинансови позиции",{"$nulls":3},{"$f":"+IF($P$2=0,$P51,0)","v":{"v":0,"d":"0 "}},{"$f":"+IF($P$2=0,$Q51,0)","v":{"v":0,"d":"0 "}},null,{"$f":"+IF(OR($P$2=98,$P$2=42,$P$2=96,$P$2=97),$P51,0)","v":{"v":483,"d":"483 "}},{"$f":"+IF(OR($P$2=98,$P$2=42,$P$2=96,$P$2=97),$Q51,0)","v":{"v":483,"d":"483 "}},null,{"$f":"+IF($P$2=33,$Q51,0)","v":{"v":0,"d":"0 "}},null,{"$f":"+ROUND(+G51+J51+L51,0)","v":{"v":483,"d":"483 "}},null,{"$f":"+ROUND(OTCHET!E205-SUM(OTCHET!E217:E219)+OTCHET!E271+IF(+OR(OTCHET!$F$12=5500,OTCHET!$F$12=5600),0,+OTCHET!E297),0)","v":{"v":483,"d":"483 "}},{"$f":"+ROUND(OTCHET!L205-SUM(OTCHET!L217:L219)+OTCHET!L271+IF(+OR(OTCHET!$F$12=5500,OTCHET!$F$12=5600),0,+OTCHET!L297),0)","v":{"v":483,"d":"483 "}},null,"разходни §§ 10-00 (без §§ 10-62, 10-63 и 10-69), 46-00 и § 00-98 (без НОИ и НЗОК)"]
[null," 2. Разходи за застраховане и други финансови услуги",{"$nulls":3},{"$f":"+IF($P$2=0,$P52,0)","v":{"v":0,"d":"0 "}},{"$f":"+IF($P$2=0,$Q52,0)","v":{"v":0,"d":"0 "}},null,{"$f":"+IF(OR($P$2=98,$P$2=42,$P$2=96,$P$2=97),$P52,0)","v":{"v":0,"d":"0 "}},{"$f":"+IF(OR($P$2=98,$P$2=42,$P$2=96,$P$2=97),$Q52,0)","v":{"v":0,"d":"0 "}},null,{"$f":"+IF($P$2=33,$Q52,0)","v":{"v":0,"d":"0 "}},null,{"$f":"+ROUND(+G52+J52+L52,0)","v":{"v":0,"d":"0 "}},null,{"$f":"+ROUND(+SUM(OTCHET!E217:E219),0)","v":{"v":0,"d":"0 "}},{"$f":"+ROUND(+SUM(OTCHET!L217:L219),0)","v":{"v":0,"d":"0 "}},null,"разходни §§ 10-62, 10-63 и 10-69"]
[null," 3. Платени данъци, такси и административни санкции",{"$nulls":3},{"$f":"+IF($P$2=0,$P53,0)","v":{"v":0,"d":"0 "}},{"$f":"+IF($P$2=0,$Q53,0)","v":{"v":0,"d":"0 "}},null,{"$f":"+IF(OR($P$2=98,$P$2=42,$P$2=96,$P$2=97),$P53,0)","v":{"v":0,"d":"0 "}},{"$f":"+IF(OR($P$2=98,$P$2=42,$P$2=96,$P$2=97),$Q53,0)","v":{"v":0,"d":"0 "}},null,{"$f":"+IF($P$2=33,$Q53,0)","v":{"v":0,"d":"0 "}},null,{"$f":"+ROUND(+G53+J53+L53,0)","v":{"v":0,"d":"0 "}},null,{"$f":"+ROUND(OTCHET!E223,0)","v":{"v":0,"d":"0 "}},{"$f":"+ROUND(OTCHET!L223,0)","v":{"v":0,"d":"0 "}},null,"разходен § 19-00"]
[null," 4. Разходи за възнаграждения на персонал",{"$nulls":3},{"$f":"+IF($P$2=0,$P54,0)","v":{"v":0,"d":"0 "}},{"$f":"+IF($P$2=0,$Q54,0)","v":{"v":0,"d":"0 "}},null,{"$f":"+IF(OR($P$2=98,$P$2=42,$P$2=96,$P$2=97),$P54,0)","v":{"v":13174,"d":"13,174 "}},{"$f":"+IF(OR($P$2=98,$P$2=42,$P$2=96,$P$2=97),$Q54,0)","v":{"v":13174,"d":"13,174 "}},null,{"$f":"+IF($P$2=33,$Q54,0)","v":{"v":0,"d":"0 "}},null,{"$f":"+ROUND(+G54+J54+L54,0)","v":{"v":13174,"d":"13,174 "}},null,{"$f":"+ROUND(OTCHET!E187+OTCHET!E190,0)","v":{"v":13174,"d":"13,174 "}},{"$f":"+ROUND(OTCHET!L187+OTCHET!L190,0)","v":{"v":13174,"d":"13,174 "}},null,"разходни §§ 01-00 и 02-00"]
[null," 5. Разходи за осигурителни вноски",{"$nulls":3},{"$f":"+IF($P$2=0,$P55,0)","v":{"v":0,"d":"0 "}},{"$f":"+IF($P$2=0,$Q55,0)","v":{"v":0,"d":"0 "}},null,{"$f":"+IF(OR($P$2=98,$P$2=42,$P$2=96,$P$2=97),$P55,0)","v":{"v":2567,"d":"2,567 "}},{"$f":"+IF(OR($P$2=98,$P$2=42,$P$2=96,$P$2=97),$Q55,0)","v":{"v":2567,"d":"2,567 "}},null,{"$f":"+IF($P$2=33,$Q55,0)","v":{"v":0,"d":"0 "}},null,{"$f":"+ROUND(+G55+J55+L55,0)","v":{"v":2567,"d":"2,567 "}},null,{"$f":"+ROUND(OTCHET!E196+OTCHET!E204,0)","v":{"v":2567,"d":"2,567 "}},{"$f":"+ROUND(OTCHET!L196+OTCHET!L204,0)","v":{"v":2567,"d":"2,567 "}},null,"разходни §§ 05-00 и 08-00"]
[null," Общо за група І. Плащания за текущи нелихвени разходи",{"$nulls":3},{"$f":"+ROUND(+SUM(F51:F55),0)","v":{"v":0,"d":"0 "}},{"$f":"+ROUND(+SUM(G51:G55),0)","v":{"v":0,"d":"0 "}},null,{"$f":"+ROUND(+SUM(I51:I55),0)","v":{"v":16224,"d":"16,224 "}},{"$f":"+ROUND(+SUM(J51:J55),0)","v":{"v":16224,"d":"16,224 "}},null,{"$f":"+ROUND(+SUM(L51:L55),0)","v":{"v":0,"d":"0 "}},null,{"$f":"+ROUND(+SUM(N51:N55),0)","v":{"v":16224,"d":"16,224 "}},null,{"$f":"+ROUND(+SUM(P51:P55),0)","v":{"v":16224,"d":"16,224 "}},{"$f":"+ROUND(+SUM(Q51:Q55),0)","v":{"v":16224,"d":"16,224 "}},null,"сборен ред за група І. Плащания за текущи нелихвени разходи"]
[null," IІ. Плащания за придобиване на нефинансови дълготрайни активи",{"$nulls":16}," IІ. Плащания за придобиване на нефинансови дълготрайни активи"]
[null," 1. Придобиване на земя",{"$nulls":3},{"$f":"+IF($P$2=0,$P58,0)","v":{"v":0,"d":"0 "}},{"$f":"+IF($P$2=0,$Q58,0)","v":{"v":0,"d":"0 "}},null,{"$f":"+IF(OR($P$2=98,$P$2=42,$P$2=96,$P$2=97),$P58,0)","v":{"v":0,"d":"0 "}},{"$f":"+IF(OR($P$2=98,$P$2=42,$P$2=96,$P$2=97),$Q58,0)","v":{"v":0,"d":"0 "}},null,{"$f":"+IF($P$2=33,$Q58,0)","v":{"v":0,"d":"0 "}},null,{"$f":"+ROUND(+G58+J58+L58,0)","v":{"v":0,"d":"0 "}},null,{"$f":"+ROUND(OTCHET!E287,0)","v":{"v":0,"d":"0 "}},{"$f":"+ROUND(OTCHET!L287,0)","v":{"v":0,"d":"0 "}},null,"разходен § 54-00"]
[null," 2. Придобиване на други дълготрайни материални активи",{"$nulls":3},{"$f":"+IF($P$2=0,$P59,0)","v":{"v":0,"d":"0 "}},{"$f":"+IF($P$2=0,$Q59,0)","v":{"v":0,"d":"0 "}},null,{"$f":"+IF(OR($P$2=98,$P$2=42,$P$2=96,$P$2=97),$P59,0)","v":{"v":0,"d":"0 "}},{"$f":"+IF(OR($P$2=98,$P$2=42,$P$2=96,$P$2=97),$Q59,0)","v":{"v":0,"d":"0 "}},null,{"$f":"+IF($P$2=33,$Q59,0)","v":{"v":0,"d":"0 "}},null,{"$f":"+ROUND(+G59+J59+L59,0)","v":{"v":0,"d":"0 "}},null,{"$f":"+ROUND(+OTCHET!E275+OTCHET!E276,0)","v":{"v":0,"d":"0 "}},{"$f":"+ROUND(+OTCHET!L275+OTCHET!L276,0)","v":{"v":0,"d":"0 "}},null,"разходни §§ 51-00 и 52-00"]
[null," 3. Придобиване на нематериални дълготрайни активи",{"$nulls":3},{"$f":"+IF($P$2=0,$P60,0)","v":{"v":0,"d":"0 "}},{"$f":"+IF($P$2=0,$Q60,0)","v":{"v":0,"d":"0 "}},null,{"$f":"+IF(OR($P$2=98,$P$2=42,$P$2=96,$P$2=97),$P60,0)","v":{"v":0,"d":"0 "}},{"$f":"+IF(OR($P$2=98,$P$2=42,$P$2=96,$P$2=97),$Q60,0)","v":{"v":0,"d":"0 "}},null,{"$f":"+IF($P$2=33,$Q60,0)","v":{"v":0,"d":"0 "}},null,{"$f":"+ROUND(+G60+J60+L60,0)","v":{"v":0,"d":"0 "}},null,{"$f":"+ROUND(OTCHET!E284,0)","v":{"v":0,"d":"0 "}},{"$f":"+ROUND(OTCHET!L284,0)","v":{"v":0,"d":"0 "}},null,"разходен § 53-00"]
[null," 4. Нето-прираст на държавния резерв и изкупуване на земеделска продукция ",{"$nulls":3},{"$f":"+IF($P$2=0,$P61,0)","v":{"v":0,"d":"0 "}},{"$f":"+IF($P$2=0,$Q61,0)","v":{"v":0,"d":"0 "}},null,{"$f":"+IF(OR($P$2=98,$P$2=42,$P$2=96,$P$2=97),$P61,0)","v":{"v":0,"d":"0 "}},{"$f":"+IF(OR($P$2=98,$P$2=42,$P$2=96,$P$2=97),$Q61,0)","v":{"v":0,"d":"0 "}},null,{"$f":"+IF($P$2=33,$Q61,0)","v":{"v":0,"d":"0 "}},null,{"$f":"+ROUND(+G61+J61+L61,0)","v":{"v":0,"d":"0 "}},null,{"$f":"+ROUND(OTCHET!E293,0)","v":{"v":0,"d":"0 "}},{"$f":"+ROUND(OTCHET!L293,0)","v":{"v":0,"d":"0 "}},null,"разходен § 57-00 и приходeн § 40-71 (-)"]
[null,"     в т. ч. постъпления от реализация на държавния резерв (-)",{"$nulls":3},{"$f":"+IF($P$2=0,$P62,0)","v":{"v":0,"d":"0 "}},{"$f":"+IF($P$2=0,$Q62,0)","v":{"v":0,"d":"0 "}},null,{"$f":"+IF(OR($P$2=98,$P$2=42,$P$2=96,$P$2=97),$P62,0)","v":{"v":0,"d":"0 "}},{"$f":"+IF(OR($P$2=98,$P$2=42,$P$2=96,$P$2=97),$Q62,0)","v":{"v":0,"d":"0 "}},null,{"$f":"+IF($P$2=33,$Q62,0)","v":{"v":0,"d":"0 "}},null,{"$f":"+ROUND(+G62+J62+L62,0)","v":{"v":0,"d":"0 "}},null,{"$f":"+ROUND(OTCHET!E296,0)","v":{"v":0,"d":"0 "}},{"$f":"+ROUND(OTCHET!L296,0)","v":{"v":0,"d":"0 "}},null,"приходeн § 40-71 (-)"]
[null," Общо за група ІІ. Плащания за на нефинансови дълготрайни активи",{"$nulls":3},{"$f":"+ROUND(+SUM(F58:F61),0)","v":{"v":0,"d":"0 "}},{"$f":"+ROUND(+SUM(G58:G61),0)","v":{"v":0,"d":"0 "}},null,{"$f":"+ROUND(+SUM(I58:I61),0)","v":{"v":0,"d":"0 "}},{"$f":"+ROUND(+SUM(J58:J61),0)","v":{"v":0,"d":"0 "}},null,{"$f":"+ROUND(+SUM(L58:L61),0)","v":{"v":0,"d":"0 "}},null,{"$f":"+ROUND(+SUM(N58:N61),0)","v":{"v":0,"d":"0 "}},null,{"$f":"+ROUND(+SUM(P58:P61),0)","v":{"v":0,"d":"0 "}},{"$f":"+ROUND(+SUM(Q58:Q61),0)","v":{"v":0,"d":"0 "}},null,"сборен ред за група ІІ. Плащания за на нефинансови дълготрайни активи"]
[null," III. Плащания за разходи за лихви",{"$nulls":16}," III. Плащания за разходи за лихви"]
[null," 1. Разходи за лихви по банкови заеми и държавни (общински) ценни книжа",{"$nulls":3},{"$f":"+IF($P$2=0,$P65,0)","v":{"v":0,"d":"0 "}},{"$f":"+IF($P$2=0,$Q65,0)","v":{"v":0,"d":"0 "}},null,{"$f":"+IF(OR($P$2=98,$P$2=42,$P$2=96,$P$2=97),$P65,0)","v":{"v":0,"d":"0 "}},{"$f":"+IF(OR($P$2=98,$P$2=42,$P$2=96,$P$2=97),$Q65,0)","v":{"v":0,"d":"0 "}},null,{"$f":"+IF($P$2=33,$Q65,0)","v":{"v":0,"d":"0 "}},null,{"$f":"+ROUND(+G65+J65+L65,0)","v":{"v":0,"d":"0 "}},null,{"$f":"+ROUND(OTCHET!E227+OTCHET!E233+SUM(OTCHET!E236:E239),0)","v":{"v":0,"d":"0 "}},{"$f":"+ROUND(OTCHET!L227+OTCHET!L233+SUM(OTCHET!L236:L239),0)","v":{"v":0,"d":"0 "}},null,"разходни §§ 21-00 ÷ 28-00"]
[null," 2. Разходи за лихви по други заеми и дългове",{"$nulls":3},{"$f":"+IF($P$2=0,$P66,0)","v":{"v":0,"d":"0 "}},{"$f":"+IF($P$2=0,$Q66,0)","v":{"v":0,"d":"0 "}},null,{"$f":"+IF(OR($P$2=98,$P$2=42,$P$2=96,$P$2=97),$P66,0)","v":{"v":0,"d":"0 "}},{"$f":"+IF(OR($P$2=98,$P$2=42,$P$2=96,$P$2=97),$Q66,0)","v":{"v":0,"d":"0 "}},null,{"$f":"+IF($P$2=33,$Q66,0)","v":{"v":0,"d":"0 "}},null,{"$f":"+ROUND(+G66+J66+L66,0)","v":{"v":0,"d":"0 "}},null,{"$f":"+ROUND(OTCHET!E240,0)","v":{"v":0,"d":"0 "}},{"$f":"+ROUND(OTCHET!L240,0)","v":{"v":0,"d":"0 "}},null,"разходен § 29-00"]
[null," Общо за група ІІІ. Плащания за разходи за лихви",{"$nulls":3},{"$f":"+ROUND(+SUM(F65:F66),0)","v":{"v":0,"d":"0 "}},{"$f":"+ROUND(+SUM(G65:G66),0)","v":{"v":0,"d":"0 "}},null,{"$f":"+ROUND(+SUM(I65:I66),0)","v":{"v":0,"d":"0 "}},{"$f":"+ROUND(+SUM(J65:J66),0)","v":{"v":0,"d":"0 "}},null,{"$f":"+ROUND(+SUM(L65:L66),0)","v":{"v":0,"d":"0 "}},null,{"$f":"+ROUND(+SUM(N65:N66),0)","v":{"v":0,"d":"0 "}},null,{"$f":"+ROUND(+SUM(P65:P66),0)","v":{"v":0,"d":"0 "}},{"$f":"+ROUND(+SUM(Q65:Q66),0)","v":{"v":0,"d":"0 "}},null,"сборен ред за група ІІІ. Плащания за разходи за лихви"]
[null," IV. Трансфери към домакинства",{"$nulls":16}," IV. Трансфери към домакинства"]
[null," 1. Осигурителни плащания и други текущи трансфери",{"$nulls":3},{"$f":"+IF($P$2=0,$P69,0)","v":{"v":0,"d":"0 "}},{"$f":"+IF($P$2=0,$Q69,0)","v":{"v":0,"d":"0 "}},null,{"$f":"+IF(OR($P$2=98,$P$2=42,$P$2=96,$P$2=97),$P69,0)","v":{"v":280,"d":"280 "}},{"$f":"+IF(OR($P$2=98,$P$2=42,$P$2=96,$P$2=97),$Q69,0)","v":{"v":280,"d":"280 "}},null,{"$f":"+IF($P$2=33,$Q69,0)","v":{"v":0,"d":"0 "}},null,{"$f":"+ROUND(+G69+J69+L69,0)","v":{"v":280,"d":"280 "}},null,{"$f":"+ROUND(+SUM(OTCHET!E255:E258)+IF(+OR(OTCHET!$F$12=5500,OTCHET!$F$12=5600),+OTCHET!E297,0),0)","v":{"v":280,"d":"280 "}},{"$f":"+ROUND(+SUM(OTCHET!L255:L258)+IF(+OR(OTCHET!$F$12=5500,OTCHET!$F$12=5600),+OTCHET!L297,0),0)","v":{"v":280,"d":"280 "}},null,"разходни §§ 39-00 ÷ 42-00 (за НОИ и НЗОК - и разходен § 00-98) "]
[null," 2. Капиталови трансфери към домакинства",{"$nulls":3},{"$f":"+IF($P$2=0,$P70,0)","v":{"v":0,"d":"0 "}},{"$f":"+IF($P$2=0,$Q70,0)","v":{"v":0,"d":"0 "}},null,{"$f":"+IF(OR($P$2=98,$P$2=42,$P$2=96,$P$2=97),$P70,0)","v":{"v":0,"d":"0 "}},{"$f":"+IF(OR($P$2=98,$P$2=42,$P$2=96,$P$2=97),$Q70,0)","v":{"v":0,"d":"0 "}},null,{"$f":"+IF($P$2=33,$Q70,0)","v":{"v":0,"d":"0 "}},null,{"$f":"+ROUND(+G70+J70+L70,0)","v":{"v":0,"d":"0 "}},null,{"$f":"+ROUND(+OTCHET!E292,0)","v":{"v":0,"d":"0 "}},{"$f":"+ROUND(+OTCHET!L292,0)","v":{"v":0,"d":"0 "}},null,"разходен § 55-04"]
[null," Общо за група ІV. Трансфери към домакинства",{"$nulls":3},{"$f":"+ROUND(+SUM(F69:F70),0)","v":{"v":0,"d":"0 "}},{"$f":"+ROUND(+SUM(G69:G70),0)","v":{"v":0,"d":"0 "}},null,{"$f":"+ROUND(+SUM(I69:I70),0)","v":{"v":280,"d":"280 "}},{"$f":"+ROUND(+SUM(J69:J70),0)","v":{"v":280,"d":"280 "}},null,{"$f":"+ROUND(+SUM(L69:L70),0)","v":{"v":0,"d":"0 "}},null,{"$f":"+ROUND(+SUM(N69:N70),0)","v":{"v":280,"d":"280 "}},null,{"$f":"+ROUND(+SUM(P69:P70),0)","v":{"v":280,"d":"280 "}},{"$f":"+ROUND(+SUM(Q69:Q70),0)","v":{"v":280,"d":"280 "}},null,"сборен ред за група ІV. Трансфери към домакинства"]
[null," V. Субсидии и капиталови трансфери",{"$nulls":16}," V. Субсидии и капиталови трансфери"]
[null," 1. Текущи субсидии и трансфери към други лица",{"$nulls":3},{"$f":"+IF($P$2=0,$P73,0)","v":{"v":0,"d":"0 "}},{"$f":"+IF($P$2=0,$Q73,0)","v":{"v":0,"d":"0 "}},null,{"$f":"+IF(OR($P$2=98,$P$2=42,$P$2=96,$P$2=97),$P73,0)","v":{"v":0,"d":"0 "}},{"$f":"+IF(OR($P$2=98,$P$2=42,$P$2=96,$P$2=97),$Q73,0)","v":{"v":0,"d":"0 "}},null,{"$f":"+IF($P$2=33,$Q73,0)","v":{"v":0,"d":"0 "}},null,{"$f":"+ROUND(+G73+J73+L73,0)","v":{"v":0,"d":"0 "}},null,{"$f":"+ROUND(+OTCHET!E249+OTCHET!E265+OTCHET!E269+OTCHET!E270+OTCHET!E273,0)","v":{"v":0,"d":"0 "}},{"$f":"+ROUND(+OTCHET!L249+OTCHET!L265+OTCHET!L269+OTCHET!L270+OTCHET!L273,0)","v":{"v":0,"d":"0 "}},null,"разходни §§ 33-00, 43-00, 44-00, 45-00 и 49-01"]
[null," 2. Капиталови трансфери към други лица",{"$nulls":3},{"$f":"+IF($P$2=0,$P74,0)","v":{"v":0,"d":"0 "}},{"$f":"+IF($P$2=0,$Q74,0)","v":{"v":0,"d":"0 "}},null,{"$f":"+IF(OR($P$2=98,$P$2=42,$P$2=96,$P$2=97),$P74,0)","v":{"v":0,"d":"0 "}},{"$f":"+IF(OR($P$2=98,$P$2=42,$P$2=96,$P$2=97),$Q74,0)","v":{"v":0,"d":"0 "}},null,{"$f":"+IF($P$2=33,$Q74,0)","v":{"v":0,"d":"0 "}},null,{"$f":"+ROUND(+G74+J74+L74,0)","v":{"v":0,"d":"0 "}},null,{"$f":"+ROUND(OTCHET!E274+OTCHET!E288-OTCHET!E292,0)","v":{"v":0,"d":"0 "}},{"$f":"+ROUND(OTCHET!L274+OTCHET!L288-OTCHET!L292,0)","v":{"v":0,"d":"0 "}},null,"разходни §§ 49-02 и 55-00 (без § 55-04)"]
[null," Общо за група V. Субсидии и капиталови трансфери",{"$nulls":3},{"$f":"+ROUND(+SUM(F73:F74),0)","v":{"v":0,"d":"0 "}},{"$f":"+ROUND(+SUM(G73:G74),0)","v":{"v":0,"d":"0 "}},null,{"$f":"+ROUND(+SUM(I73:I74),0)","v":{"v":0,"d":"0 "}},{"$f":"+ROUND(+SUM(J73:J74),0)","v":{"v":0,"d":"0 "}},null,{"$f":"+ROUND(+SUM(L73:L74),0)","v":{"v":0,"d":"0 "}},null,{"$f":"+ROUND(+SUM(N73:N74),0)","v":{"v":0,"d":"0 "}},null,{"$f":"+ROUND(+SUM(P73:P74),0)","v":{"v":0,"d":"0 "}},{"$f":"+ROUND(+SUM(Q73:Q74),0)","v":{"v":0,"d":"0 "}},null,"сборен ред за група V. Субсидии и капиталови трансфери"]
[]
[null," Б. ОБЩО РАЗХОДИ И ПРИДОБИВАНЕ НА НЕФИНАНСОВИ АКТИВИ",{"$nulls":3},{"$f":"+ROUND(F56+F63+F67+F71+F75,0)","v":{"v":0,"d":"0 "}},{"$f":"+ROUND(G56+G63+G67+G71+G75,0)","v":{"v":0,"d":"0 "}},null,{"$f":"+ROUND(I56+I63+I67+I71+I75,0)","v":{"v":16504,"d":"16,504 "}},{"$f":"+ROUND(J56+J63+J67+J71+J75,0)","v":{"v":16504,"d":"16,504 "}},null,{"$f":"+ROUND(L56+L63+L67+L71+L75,0)","v":{"v":0,"d":"0 "}},null,{"$f":"+ROUND(N56+N63+N67+N71+N75,0)","v":{"v":16504,"d":"16,504 "}},null,{"$f":"+ROUND(P56+P63+P67+P71+P75,0)","v":{"v":16504,"d":"16,504 "}},{"$f":"+ROUND(Q56+Q63+Q67+Q71+Q75,0)","v":{"v":16504,"d":"16,504 "}},null," сборен за ред Б. ОБЩО РАЗХОДИ И ПРИДОБИВАНЕ НА НЕФИН. АКТИВИ"]
[null," В. ТРАНСФЕРИ И БЕЗЛИХВЕНИ ЗАЕМИ М/У БЮДЖ. ОРГАНИЗАЦИИ",{"$nulls":16}," В. ТРАНСФЕРИ И БЕЗЛИХВЕНИ ЗАЕМИ М/У БЮДЖ. ОРГАНИЗАЦИИ"]
[null," 1. Трансфери между бюджетни организации (нето)",{"$nulls":3},{"$f":"+IF($P$2=0,$P79,0)","v":{"v":0,"d":"0 "}},{"$f":"+IF($P$2=0,$Q79,0)","v":{"v":0,"d":"0 "}},null,{"$f":"+IF(OR($P$2=98,$P$2=42,$P$2=96,$P$2=97),$P79,0)","v":{"v":12290,"d":"12,290 "}},{"$f":"+IF(OR($P$2=98,$P$2=42,$P$2=96,$P$2=97),$Q79,0)","v":{"v":12290,"d":"12,290 "}},null,{"$f":"+IF($P$2=33,$Q79,0)","v":{"v":0,"d":"0 "}},null,{"$f":"+ROUND(+G79+J79+L79,0)","v":{"v":12290,"d":"12,290 "}},null,{"$f":"+ROUND(OTCHET!E419,0)","v":{"v":12290,"d":"12,290 "}},{"$f":"+ROUND(OTCHET!L419,0)","v":{"v":12290,"d":"12,290 "}},null,"трансферни параграфи §§ 30-00 ÷ 32-00 и 60-00 ÷ 69-00"]
[null," 2. Временни безлихвени заеми между бюджетни организации (нето)",{"$nulls":3},{"$f":"+IF($P$2=0,$P80,0)","v":{"v":0,"d":"0 "}},{"$f":"+IF($P$2=0,$Q80,0)","v":{"v":0,"d":"0 "}},null,{"$f":"+IF(OR($P$2=98,$P$2=42,$P$2=96,$P$2=97),$P80,0)","v":{"v":0,"d":"0 "}},{"$f":"+IF(OR($P$2=98,$P$2=42,$P$2=96,$P$2=97),$Q80,0)","v":{"v":0,"d":"0 "}},null,{"$f":"+IF($P$2=33,$Q80,0)","v":{"v":0,"d":"0 "}},null,{"$f":"+ROUND(+G80+J80+L80,0)","v":{"v":0,"d":"0 "}},null,{"$f":"+ROUND(OTCHET!E429,0)","v":{"v":0,"d":"0 "}},{"$f":"+ROUND(OTCHET!L429,0)","v":{"v":0,"d":"0 "}},null,"трансферни параграфи §§ 74-00 ÷ 78-00"]
[null," В. ОБЩО ТРАНСФЕРИ И  ЗАЕМИ М/У БЮДЖЕТНИ ОРГАНИЗАЦИИ",{"$nulls":3},{"$f":"+ROUND(F79+F80,0)","v":{"v":0,"d":"0 "}},{"$f":"+ROUND(G79+G80,0)","v":{"v":0,"d":"0 "}},null,{"$f":"+ROUND(I79+I80,0)","v":{"v":12290,"d":"12,290 "}},{"$f":"+ROUND(J79+J80,0)","v":{"v":12290,"d":"12,290 "}},null,{"$f":"+ROUND(L79+L80,0)","v":{"v":0,"d":"0 "}},null,{"$f":"+ROUND(N79+N80,0)","v":{"v":12290,"d":"12,290 "}},null,{"$f":"+ROUND(P79+P80,0)","v":{"v":12290,"d":"12,290 "}},{"$f":"+ROUND(Q79+Q80,0)","v":{"v":12290,"d":"12,290 "}},null," сборен ред за  В. ОБЩО ТРАНСФЕРИ И  ЗАЕМИ М/У БЮДЖ. ОРГАНИЗАЦИИ"]
[null,{"$f":"+IF(+SUM(F82:N82)=0,0,\"Контрола: дефицит/излишък = финансиране с обратен знак (Г. + Д. = 0)\")","v":0},{"$nulls":3},{"$f":"+ROUND(F83,0)+ROUND(F84,0)","v":0},{"$f":"+ROUND(G83,0)+ROUND(G84,0)","v":0},null,{"$f":"+ROUND(I83,0)+ROUND(I84,0)","v":0},{"$f":"+ROUND(J83,0)+ROUND(J84,0)","v":0},null,{"$f":"+ROUND(L83,0)+ROUND(L84,0)","v":0},null,{"$f":"+ROUND(N83,0)+ROUND(N84,0)","v":0},null,{"$f":"+ROUND(P83,0)+ROUND(P84,0)","v":0},{"$f":"+ROUND(Q83,0)+ROUND(Q84,0)","v":0}]
[null,"Г. Бюджетно салдо: Дефицит (-) / излишък (+) = (А. - Б. + В. )",{"$nulls":3},{"$f":"+ROUND(F48,0)-ROUND(F77,0)+ROUND(F81,0)","v":{"v":0,"d":"0 "}},{"$f":"+ROUND(G48,0)-ROUND(G77,0)+ROUND(G81,0)","v":{"v":0,"d":"0 "}},null,{"$f":"+ROUND(I48,0)-ROUND(I77,0)+ROUND(I81,0)","v":{"v":-4214,"d":"(4,214)"}},{"$f":"+ROUND(J48,0)-ROUND(J77,0)+ROUND(J81,0)","v":{"v":-4214,"d":"(4,214)"}},null,{"$f":"+ROUND(L48,0)-ROUND(L77,0)+ROUND(L81,0)","v":{"v":0,"d":"0 "}},null,{"$f":"+ROUND(N48,0)-ROUND(N77,0)+ROUND(N81,0)","v":{"v":-4214,"d":"(4,214)"}},null,{"$f":"+ROUND(P48,0)-ROUND(P77,0)+ROUND(P81,0)","v":{"v":-4214,"d":"(4,214)"}},{"$f":"+ROUND(Q48,0)-ROUND(Q77,0)+ROUND(Q81,0)","v":{"v":-4214,"d":"(4,214)"}},null,"Г. Бюджетно салдо: Дефицит (-) / излишък (+) = (А. - Б. + В. )"]
[null,"Д. Финансиране на бюджетното салдо (Е. + Ж. + З. - И.)",{"$nulls":3},{"$f":"+ROUND(F101,0)+ROUND(F120,0)+ROUND(F127,0)-ROUND(F132,0)","v":{"v":0,"d":"0 "}},{"$f":"+ROUND(G101,0)+ROUND(G120,0)+ROUND(G127,0)-ROUND(G132,0)","v":{"v":0,"d":"0 "}},null,{"$f":"+ROUND(I101,0)+ROUND(I120,0)+ROUND(I127,0)-ROUND(I132,0)","v":{"v":4214,"d":"4,214 "}},{"$f":"+ROUND(J101,0)+ROUND(J120,0)+ROUND(J127,0)-ROUND(J132,0)","v":{"v":4214,"d":"4,214 "}},null,{"$f":"+ROUND(L101,0)+ROUND(L120,0)+ROUND(L127,0)-ROUND(L132,0)","v":{"v":0,"d":"0 "}},null,{"$f":"+ROUND(N101,0)+ROUND(N120,0)+ROUND(N127,0)-ROUND(N132,0)","v":{"v":4214,"d":"4,214 "}},null,{"$f":"+ROUND(P101,0)+ROUND(P120,0)+ROUND(P127,0)-ROUND(P132,0)","v":{"v":4214,"d":"4,214 "}},{"$f":"+ROUND(Q101,0)+ROUND(Q120,0)+ROUND(Q127,0)-ROUND(Q132,0)","v":{"v":4214,"d":"4,214 "}},null,"Д. Финансиране на бюджетното салдо (Е. + Ж. + З. - И.)"]
[null," Е. ОПЕРАЦИИ С ФИНАНСОВИ АКТИВИ",{"$nulls":16}," Е. ОПЕРАЦИИ С ФИНАНСОВИ АКТИВИ"]
[null," I. Придобиване и реализиране на дялове, акции и участия",{"$nulls":16}," I. Придобиване и реализиране на дялове, акции и участия"]
[null," 1. Придобиване на дялове, акции и участия в предприятия (-)",{"$nulls":3},{"$f":"+IF($P$2=0,$P87,0)","v":{"v":0,"d":"0 "}},{"$f":"+IF($P$2=0,$Q87,0)","v":{"v":0,"d":"0 "}},null,{"$f":"+IF(OR($P$2=98,$P$2=42,$P$2=96,$P$2=97),$P87,0)","v":{"v":0,"d":"0 "}},{"$f":"+IF(OR($P$2=98,$P$2=42,$P$2=96,$P$2=97),$Q87,0)","v":{"v":0,"d":"0 "}},null,{"$f":"+IF($P$2=33,$Q87,0)","v":{"v":0,"d":"0 "}},null,{"$f":"+ROUND(+G87+J87+L87,0)","v":{"v":0,"d":"0 "}},null,{"$f":"+ROUND(+OTCHET!E462+OTCHET!E463,0)","v":{"v":0,"d":"0 "}},{"$f":"+ROUND(+OTCHET!L462+OTCHET!L463,0)","v":{"v":0,"d":"0 "}},null,"финансиращи §§ 70-01 и 70-03"]
[null," 2. Постъпления от реализация и приватизация на дялове, акциии и участия",{"$nulls":3},{"$f":"+IF($P$2=0,$P88,0)","v":{"v":0,"d":"0 "}},{"$f":"+IF($P$2=0,$Q88,0)","v":{"v":0,"d":"0 "}},null,{"$f":"+IF(OR($P$2=98,$P$2=42,$P$2=96,$P$2=97),$P88,0)","v":{"v":0,"d":"0 "}},{"$f":"+IF(OR($P$2=98,$P$2=42,$P$2=96,$P$2=97),$Q88,0)","v":{"v":0,"d":"0 "}},null,{"$f":"+IF($P$2=33,$Q88,0)","v":{"v":0,"d":"0 "}},null,{"$f":"+ROUND(+G88+J88+L88,0)","v":{"v":0,"d":"0 "}},null,{"$f":"+ROUND(OTCHET!E464+OTCHET!E535,0)","v":{"v":0,"d":"0 "}},{"$f":"+ROUND(OTCHET!L464+OTCHET!L535,0)","v":{"v":0,"d":"0 "}},null,"финансиращи §§ 70-10 и 90-00"]
[null," Общо за група І. Придобиване и реализиране на дялове, акции и участия",{"$nulls":3},{"$f":"+ROUND(+SUM(F87:F88),0)","v":{"v":0,"d":"0 "}},{"$f":"+ROUND(+SUM(G87:G88),0)","v":{"v":0,"d":"0 "}},null,{"$f":"+ROUND(+SUM(I87:I88),0)","v":{"v":0,"d":"0 "}},{"$f":"+ROUND(+SUM(J87:J88),0)","v":{"v":0,"d":"0 "}},null,{"$f":"+ROUND(+SUM(L87:L88),0)","v":{"v":0,"d":"0 "}},null,{"$f":"+ROUND(+SUM(N87:N88),0)","v":{"v":0,"d":"0 "}},null,{"$f":"+ROUND(+SUM(P87:P88),0)","v":{"v":0,"d":"0 "}},{"$f":"+ROUND(+SUM(Q87:Q88),0)","v":{"v":0,"d":"0 "}},null," Сборен ред за група І. Придобиване и реализиране на дялове, акции и участия"]
[null," IІ. Предоставени заеми, възмездна фин. помощ и активирани гаранции",{"$nulls":16}," IІ. Предоставени заеми, възмездна фин. помощ и активирани гаранции"]
[null," 1. Предоставени заеми и възмездна финансова помощ (-)",{"$nulls":3},{"$f":"+IF($P$2=0,$P91,0)","v":{"v":0,"d":"0 "}},{"$f":"+IF($P$2=0,$Q91,0)","v":{"v":0,"d":"0 "}},null,{"$f":"+IF(OR($P$2=98,$P$2=42,$P$2=96,$P$2=97),$P91,0)","v":{"v":0,"d":"0 "}},{"$f":"+IF(OR($P$2=98,$P$2=42,$P$2=96,$P$2=97),$Q91,0)","v":{"v":0,"d":"0 "}},null,{"$f":"+IF($P$2=33,$Q91,0)","v":{"v":0,"d":"0 "}},null,{"$f":"+ROUND(+G91+J91+L91,0)","v":{"v":0,"d":"0 "}},null,{"$f":"+ROUND(OTCHET!E466+OTCHET!E469+OTCHET!E479,0)","v":{"v":0,"d":"0 "}},{"$f":"+ROUND(OTCHET!L466+OTCHET!L469+OTCHET!L479,0)","v":{"v":0,"d":"0 "}},null,"финансиращи §§ 71-01, 72-01 и 79-01"]
[null," 2. Получени погашения по предоставени заеми и възмездна фин. помощ (+)",{"$nulls":3},{"$f":"+IF($P$2=0,$P92,0)","v":{"v":0,"d":"0 "}},{"$f":"+IF($P$2=0,$Q92,0)","v":{"v":0,"d":"0 "}},null,{"$f":"+IF(OR($P$2=98,$P$2=42,$P$2=96,$P$2=97),$P92,0)","v":{"v":0,"d":"0 "}},{"$f":"+IF(OR($P$2=98,$P$2=42,$P$2=96,$P$2=97),$Q92,0)","v":{"v":0,"d":"0 "}},null,{"$f":"+IF($P$2=33,$Q92,0)","v":{"v":0,"d":"0 "}},null,{"$f":"+ROUND(+G92+J92+L92,0)","v":{"v":0,"d":"0 "}},null,{"$f":"+ROUND(OTCHET!E467+OTCHET!E470+OTCHET!E480+OTCHET!E502+IF(+OTCHET!E494>0,+OTCHET!E494,0),0)","v":{"v":0,"d":"0 "}},{"$f":"+ROUND(OTCHET!L467+OTCHET!L470+OTCHET!L480+OTCHET!L502+IF(+OTCHET!L494>0,+OTCHET!L494,0),0)","v":{"v":0,"d":"0 "}},null,"финансиращи §§ 71-02, 72-02, 79-02 и 82-00 и § 80-80 (ако е \"плюс\")"]
[null," 3. Плащания по активирани гаранции  - главници по гарантирани заеми",{"$nulls":3},{"$f":"+IF($P$2=0,$P93,0)","v":{"v":0,"d":"0 "}},{"$f":"+IF($P$2=0,$Q93,0)","v":{"v":0,"d":"0 "}},null,{"$f":"+IF(OR($P$2=98,$P$2=42,$P$2=96,$P$2=97),$P93,0)","v":{"v":0,"d":"0 "}},{"$f":"+IF(OR($P$2=98,$P$2=42,$P$2=96,$P$2=97),$Q93,0)","v":{"v":0,"d":"0 "}},null,{"$f":"+IF($P$2=33,$Q93,0)","v":{"v":0,"d":"0 "}},null,{"$f":"+ROUND(+G93+J93+L93,0)","v":{"v":0,"d":"0 "}},null,{"$f":"+ROUND(+SUM(OTCHET!E472:E474),0)","v":{"v":0,"d":"0 "}},{"$f":"+ROUND(+SUM(OTCHET!L472:L474),0)","v":{"v":0,"d":"0 "}},null,"финансиращи §§ 73-20, 73-69 и 73-70"]
[null," 4. Възстановени суми по активирани гаранции - главници",{"$nulls":3},{"$f":"+IF($P$2=0,$P94,0)","v":{"v":0,"d":"0 "}},{"$f":"+IF($P$2=0,$Q94,0)","v":{"v":0,"d":"0 "}},null,{"$f":"+IF(OR($P$2=98,$P$2=42,$P$2=96,$P$2=97),$P94,0)","v":{"v":0,"d":"0 "}},{"$f":"+IF(OR($P$2=98,$P$2=42,$P$2=96,$P$2=97),$Q94,0)","v":{"v":0,"d":"0 "}},null,{"$f":"+IF($P$2=33,$Q94,0)","v":{"v":0,"d":"0 "}},null,{"$f":"+ROUND(+G94+J94+L94,0)","v":{"v":0,"d":"0 "}},null,{"$f":"+ROUND(+SUM(OTCHET!E475:E476),0)","v":{"v":0,"d":"0 "}},{"$f":"+ROUND(+SUM(OTCHET!L475:L476),0)","v":{"v":0,"d":"0 "}},null,"финансиращи §§ 73-91 и 73-92"]
[null," Общо за група ІІ. Предоставени заеми, възмездна фин. помощ и гаранции",{"$nulls":3},{"$f":"+ROUND(+SUM(F91:F94),0)","v":{"v":0,"d":"0 "}},{"$f":"+ROUND(+SUM(G91:G94),0)","v":{"v":0,"d":"0 "}},null,{"$f":"+ROUND(+SUM(I91:I94),0)","v":{"v":0,"d":"0 "}},{"$f":"+ROUND(+SUM(J91:J94),0)","v":{"v":0,"d":"0 "}},null,{"$f":"+ROUND(+SUM(L91:L94),0)","v":{"v":0,"d":"0 "}},null,{"$f":"+ROUND(+SUM(N91:N94),0)","v":{"v":0,"d":"0 "}},null,{"$f":"+ROUND(+SUM(P91:P94),0)","v":{"v":0,"d":"0 "}},{"$f":"+ROUND(+SUM(Q91:Q94),0)","v":{"v":0,"d":"0 "}},null," Сборен ред за група ІІ. Предоставени заеми, възмездна фин. помощ и гаранции"]
[null," IІI. Други операции с финансови активи",{"$nulls":16}," IІI. Други операции с финансови активи"]
[null," 1. Нето-операции с други ценни книжа  и фин. активи (кеш-мениджмънт)",{"$nulls":3},{"$f":"+IF($P$2=0,$P97,0)","v":{"v":0,"d":"0 "}},{"$f":"+IF($P$2=0,$Q97,0)","v":{"v":0,"d":"0 "}},null,{"$f":"+IF(OR($P$2=98,$P$2=42,$P$2=96,$P$2=97),$P97,0)","v":{"v":0,"d":"0 "}},{"$f":"+IF(OR($P$2=98,$P$2=42,$P$2=96,$P$2=97),$Q97,0)","v":{"v":0,"d":"0 "}},null,{"$f":"+IF($P$2=33,$Q97,0)","v":{"v":0,"d":"0 "}},null,{"$f":"+ROUND(+G97+J97+L97,0)","v":{"v":0,"d":"0 "}},null,{"$f":"+ROUND(OTCHET!E536+OTCHET!E541,0)","v":{"v":0,"d":"0 "}},{"$f":"+ROUND(OTCHET!L536+OTCHET!L541,0)","v":{"v":0,"d":"0 "}},null,"финансиращи §§ 91-01 и 92-00"]
[null," 2. Други операции с финансови активи (нето)",{"$nulls":3},{"$f":"+IF($P$2=0,$P98,0)","v":{"v":0,"d":"0 "}},{"$f":"+IF($P$2=0,$Q98,0)","v":{"v":0,"d":"0 "}},null,{"$f":"+IF(OR($P$2=98,$P$2=42,$P$2=96,$P$2=97),$P98,0)","v":{"v":0,"d":"0 "}},{"$f":"+IF(OR($P$2=98,$P$2=42,$P$2=96,$P$2=97),$Q98,0)","v":{"v":0,"d":"0 "}},null,{"$f":"+IF($P$2=33,$Q98,0)","v":{"v":0,"d":"0 "}},null,{"$f":"+ROUND(+G98+J98+L98,0)","v":{"v":0,"d":"0 "}},null,{"$f":"+ROUND(+OTCHET!E477+OTCHET!E558+OTCHET!E560,0)","v":{"v":0,"d":"0 "}},{"$f":"+ROUND(+OTCHET!L477+OTCHET!L558+OTCHET!L560,0)","v":{"v":0,"d":"0 "}},null,"финансиращи §§ 73-93, 93-36, 93-38"]
[null," Общо за група ІІІ. Други операции с финансови активи",{"$nulls":3},{"$f":"+ROUND(+SUM(F97:F98),0)","v":{"v":0,"d":"0 "}},{"$f":"+ROUND(+SUM(G97:G98),0)","v":{"v":0,"d":"0 "}},null,{"$f":"+ROUND(+SUM(I97:I98),0)","v":{"v":0,"d":"0 "}},{"$f":"+ROUND(+SUM(J97:J98),0)","v":{"v":0,"d":"0 "}},null,{"$f":"+ROUND(+SUM(L97:L98),0)","v":{"v":0,"d":"0 "}},null,{"$f":"+ROUND(+SUM(N97:N98),0)","v":{"v":0,"d":"0 "}},null,{"$f":"+ROUND(+SUM(P97:P98),0)","v":{"v":0,"d":"0 "}},{"$f":"+ROUND(+SUM(Q97:Q98),0)","v":{"v":0,"d":"0 "}},null,"  Сборен ред за група ІІІ. Други операции с финансови активи"]
[]
[null," Е. ОБЩО ОПЕРАЦИИ С ФИНАНСОВИ АКТИВИ",{"$nulls":3},{"$f":"+ROUND(F89+F95+F99,0)","v":{"v":0,"d":"0 "}},{"$f":"+ROUND(G89+G95+G99,0)","v":{"v":0,"d":"0 "}},null,{"$f":"+ROUND(I89+I95+I99,0)","v":{"v":0,"d":"0 "}},{"$f":"+ROUND(J89+J95+J99,0)","v":{"v":0,"d":"0 "}},null,{"$f":"+ROUND(L89+L95+L99,0)","v":{"v":0,"d":"0 "}},null,{"$f":"+ROUND(N89+N95+N99,0)","v":{"v":0,"d":"0 "}},null,{"$f":"+ROUND(P89+P95+P99,0)","v":{"v":0,"d":"0 "}},{"$f":"+ROUND(Q89+Q95+Q99,0)","v":{"v":0,"d":"0 "}},null," Сборен ред за Е. ОБЩО ОПЕРАЦИИ С ФИНАНСОВИ АКТИВИ"]
[null," Ж. ОПЕРАЦИИ С ФИНАНСОВИ ПАСИВИ",{"$nulls":16}," Ж. ОПЕРАЦИИ С ФИНАНСОВИ ПАСИВИ"]
[null," I. Емитирани държавни (общински) ценни книжа",{"$nulls":16}," I. Емитирани държавни (общински) ценни книжа"]
[null," 1. Постъпления от емисии на държавни (общински) ценни книжа (+)",{"$nulls":3},{"$f":"+IF($P$2=0,$P104,0)","v":{"v":0,"d":"0 "}},{"$f":"+IF($P$2=0,$Q104,0)","v":{"v":0,"d":"0 "}},null,{"$f":"+IF(OR($P$2=98,$P$2=42,$P$2=96,$P$2=97),$P104,0)","v":{"v":0,"d":"0 "}},{"$f":"+IF(OR($P$2=98,$P$2=42,$P$2=96,$P$2=97),$Q104,0)","v":{"v":0,"d":"0 "}},null,{"$f":"+IF($P$2=33,$Q104,0)","v":{"v":0,"d":"0 "}},null,{"$f":"+ROUND(+G104+J104+L104,0)","v":{"v":0,"d":"0 "}},null,{"$f":"+ROUND(OTCHET!E498+OTCHET!E499+OTCHET!E512,0)","v":{"v":0,"d":"0 "}},{"$f":"+ROUND(OTCHET!L498+OTCHET!L499+OTCHET!L512,0)","v":{"v":0,"d":"0 "}},null,"финансиращи §§ 81-11, 81-12 и 85-00"]
[null," 2. Погашения по емисии на държавни (общински) ценни книжа) (-)",{"$nulls":3},{"$f":"+IF($P$2=0,$P105,0)","v":{"v":0,"d":"0 "}},{"$f":"+IF($P$2=0,$Q105,0)","v":{"v":0,"d":"0 "}},null,{"$f":"+IF(OR($P$2=98,$P$2=42,$P$2=96,$P$2=97),$P105,0)","v":{"v":0,"d":"0 "}},{"$f":"+IF(OR($P$2=98,$P$2=42,$P$2=96,$P$2=97),$Q105,0)","v":{"v":0,"d":"0 "}},null,{"$f":"+IF($P$2=33,$Q105,0)","v":{"v":0,"d":"0 "}},null,{"$f":"+ROUND(+G105+J105+L105,0)","v":{"v":0,"d":"0 "}},null,{"$f":"+ROUND(OTCHET!E500+OTCHET!E501+OTCHET!E516,0)","v":{"v":0,"d":"0 "}},{"$f":"+ROUND(OTCHET!L500+OTCHET!L501+OTCHET!L516,0)","v":{"v":0,"d":"0 "}},null,"финансиращи §§ 81-21, 81-22 и 86-00"]
[null," Общо за група І. Емитирани държавни (общински) ценни книжа",{"$nulls":3},{"$f":"+ROUND(+SUM(F104:F105),0)","v":{"v":0,"d":"0 "}},{"$f":"+ROUND(+SUM(G104:G105),0)","v":{"v":0,"d":"0 "}},null,{"$f":"+ROUND(+SUM(I104:I105),0)","v":{"v":0,"d":"0 "}},{"$f":"+ROUND(+SUM(J104:J105),0)","v":{"v":0,"d":"0 "}},null,{"$f":"+ROUND(+SUM(L104:L105),0)","v":{"v":0,"d":"0 "}},null,{"$f":"+ROUND(+SUM(N104:N105),0)","v":{"v":0,"d":"0 "}},null,{"$f":"+ROUND(+SUM(P104:P105),0)","v":{"v":0,"d":"0 "}},{"$f":"+ROUND(+SUM(Q104:Q105),0)","v":{"v":0,"d":"0 "}},null," Сборен ред за група І. Емитирани държавни (общински) ценни книжа"]
[null," IІ. Заеми от банки и други лица",{"$nulls":16}," IІ. Заеми от банки и други лица"]
[null," 1. Получени банкови и други заеми (+)",{"$nulls":3},{"$f":"+IF($P$2=0,$P108,0)","v":{"v":0,"d":"0 "}},{"$f":"+IF($P$2=0,$Q108,0)","v":{"v":0,"d":"0 "}},null,{"$f":"+IF(OR($P$2=98,$P$2=42,$P$2=96,$P$2=97),$P108,0)","v":{"v":0,"d":"0 "}},{"$f":"+IF(OR($P$2=98,$P$2=42,$P$2=96,$P$2=97),$Q108,0)","v":{"v":0,"d":"0 "}},null,{"$f":"+IF($P$2=33,$Q108,0)","v":{"v":0,"d":"0 "}},null,{"$f":"+ROUND(+G108+J108+L108,0)","v":{"v":0,"d":"0 "}},null,{"$f":"+ROUND(OTCHET!E482+OTCHET!E483+OTCHET!E486+OTCHET!E487+OTCHET!E490+OTCHET!E491+OTCHET!E495+OTCHET!E504+OTCHET!E505+OTCHET!E508+OTCHET!E509,0)","v":{"v":0,"d":"0 "}},{"$f":"+ROUND(OTCHET!L482+OTCHET!L483+OTCHET!L486+OTCHET!L487+OTCHET!L490+OTCHET!L491+OTCHET!L495+OTCHET!L504+OTCHET!L505+OTCHET!L508+OTCHET!L509,0)","v":{"v":0,"d":"0 "}},null,"финансиращи §§ 80-11, 80-12, 80-31, 80-32, 80-51, 80-52, 80-97, 83-11, 83-12, 83-71, 83-72 "]
[null," 2. Погашения по получени банкови и други заеми (-)",{"$nulls":3},{"$f":"+IF($P$2=0,$P109,0)","v":{"v":0,"d":"0 "}},{"$f":"+IF($P$2=0,$Q109,0)","v":{"v":0,"d":"0 "}},null,{"$f":"+IF(OR($P$2=98,$P$2=42,$P$2=96,$P$2=97),$P109,0)","v":{"v":0,"d":"0 "}},{"$f":"+IF(OR($P$2=98,$P$2=42,$P$2=96,$P$2=97),$Q109,0)","v":{"v":0,"d":"0 "}},null,{"$f":"+IF($P$2=33,$Q109,0)","v":{"v":0,"d":"0 "}},null,{"$f":"+ROUND(+G109+J109+L109,0)","v":{"v":0,"d":"0 "}},null,{"$f":"+ROUND(OTCHET!E484+OTCHET!E485+OTCHET!E488+OTCHET!E489+OTCHET!E492+OTCHET!E493+OTCHET!E496+OTCHET!E506+OTCHET!E507+OTCHET!E510+OTCHET!E511+IF(+OTCHET!E494<0,+OTCHET!E494,0),0)","v":{"v":0,"d":"0 "}},{"$f":"+ROUND(OTCHET!L484+OTCHET!L485+OTCHET!L488+OTCHET!L489+OTCHET!L492+OTCHET!L493+OTCHET!L496+OTCHET!L506+OTCHET!L507+OTCHET!L510+OTCHET!L511+IF(+OTCHET!L494<0,+OTCHET!L494,0),0)","v":{"v":0,"d":"0 "}},null,"§§ 80-17, 80-18, 80-37, 80-38, 80-57, 80-58, 80-98, 83-21, 83-22, 83-81, 83-82 и § 80-80 (ако е \"минус\")"]
[null," Общо за група ІІ. Заеми от банки и други лица",{"$nulls":3},{"$f":"+ROUND(+SUM(F108:F109),0)","v":{"v":0,"d":"0 "}},{"$f":"+ROUND(+SUM(G108:G109),0)","v":{"v":0,"d":"0 "}},null,{"$f":"+ROUND(+SUM(I108:I109),0)","v":{"v":0,"d":"0 "}},{"$f":"+ROUND(+SUM(J108:J109),0)","v":{"v":0,"d":"0 "}},null,{"$f":"+ROUND(+SUM(L108:L109),0)","v":{"v":0,"d":"0 "}},null,{"$f":"+ROUND(+SUM(N108:N109),0)","v":{"v":0,"d":"0 "}},null,{"$f":"+ROUND(+SUM(P108:P109),0)","v":{"v":0,"d":"0 "}},{"$f":"+ROUND(+SUM(Q108:Q109),0)","v":{"v":0,"d":"0 "}},null,"Сборен ред за група ІІ. Заеми от банки и други лица"]
[null," IІI. Финансиране чрез финансов лизинг и търговски кредит",{"$nulls":16}," IІI. Финансиране чрез финансов лизинг и търговски кредит"]
[null," 1. Получено финансиране по финансов лизинг и търговски кредит (+)",{"$nulls":3},{"$f":"+IF($P$2=0,$P112,0)","v":{"v":0,"d":"0 "}},{"$f":"+IF($P$2=0,$Q112,0)","v":{"v":0,"d":"0 "}},null,{"$f":"+IF(OR($P$2=98,$P$2=42,$P$2=96,$P$2=97),$P112,0)","v":{"v":0,"d":"0 "}},{"$f":"+IF(OR($P$2=98,$P$2=42,$P$2=96,$P$2=97),$Q112,0)","v":{"v":0,"d":"0 "}},null,{"$f":"+IF($P$2=33,$Q112,0)","v":{"v":0,"d":"0 "}},null,{"$f":"+ROUND(+G112+J112+L112,0)","v":{"v":0,"d":"0 "}},null,{"$f":"+ROUND(OTCHET!E547,0)","v":{"v":0,"d":"0 "}},{"$f":"+ROUND(OTCHET!L547,0)","v":{"v":0,"d":"0 "}},null,"финансиращ § 93-17"]
[null," 2. Погашения по финансов лизинг и търговски кредит (-)",{"$nulls":3},{"$f":"+IF($P$2=0,$P113,0)","v":{"v":0,"d":"0 "}},{"$f":"+IF($P$2=0,$Q113,0)","v":{"v":0,"d":"0 "}},null,{"$f":"+IF(OR($P$2=98,$P$2=42,$P$2=96,$P$2=97),$P113,0)","v":{"v":0,"d":"0 "}},{"$f":"+IF(OR($P$2=98,$P$2=42,$P$2=96,$P$2=97),$Q113,0)","v":{"v":0,"d":"0 "}},null,{"$f":"+IF($P$2=33,$Q113,0)","v":{"v":0,"d":"0 "}},null,{"$f":"+ROUND(+G113+J113+L113,0)","v":{"v":0,"d":"0 "}},null,{"$f":"+ROUND(OTCHET!E548,0)","v":{"v":0,"d":"0 "}},{"$f":"+ROUND(OTCHET!L548,0)","v":{"v":0,"d":"0 "}},null,"финансиращ § 93-18"]
[null," Общо за група ІІІ. Финансиране чрез фин. лизинг и търговски кредит",{"$nulls":3},{"$f":"+ROUND(+SUM(F112:F113),0)","v":{"v":0,"d":"0 "}},{"$f":"+ROUND(+SUM(G112:G113),0)","v":{"v":0,"d":"0 "}},null,{"$f":"+ROUND(+SUM(I112:I113),0)","v":{"v":0,"d":"0 "}},{"$f":"+ROUND(+SUM(J112:J113),0)","v":{"v":0,"d":"0 "}},null,{"$f":"+ROUND(+SUM(L112:L113),0)","v":{"v":0,"d":"0 "}},null,{"$f":"+ROUND(+SUM(N112:N113),0)","v":{"v":0,"d":"0 "}},null,{"$f":"+ROUND(+SUM(P112:P113),0)","v":{"v":0,"d":"0 "}},{"$f":"+ROUND(+SUM(Q112:Q113),0)","v":{"v":0,"d":"0 "}},null,"Сборен ред за група ІІІ. Финансиране чрез фин. лизинг и търговски кредит"]
[null,"ІV. Други операции с финансови пасиви",{"$nulls":16},"ІV. Други операции с финансови пасиви"]
[null," 1. Операции с чужди средства (нето)",{"$nulls":3},{"$f":"+IF($P$2=0,$P116,0)","v":{"v":0,"d":"0 "}},{"$f":"+IF($P$2=0,$Q116,0)","v":{"v":0,"d":"0 "}},null,{"$f":"+IF(OR($P$2=98,$P$2=42,$P$2=96,$P$2=97),$P116,0)","v":{"v":0,"d":"0 "}},{"$f":"+IF(OR($P$2=98,$P$2=42,$P$2=96,$P$2=97),$Q116,0)","v":{"v":0,"d":"0 "}},null,{"$f":"+IF($P$2=33,$Q116,0)","v":{"v":0,"d":"0 "}},null,{"$f":"+ROUND(+G116+J116+L116,0)","v":{"v":0,"d":"0 "}},null,{"$f":"+ROUND(OTCHET!E545+OTCHET!E546+OTCHET!E562+OTCHET!E563,0)","v":{"v":0,"d":"0 "}},{"$f":"+ROUND(OTCHET!L545+OTCHET!L546+OTCHET!L562+OTCHET!L563,0)","v":{"v":0,"d":"0 "}},null,"финансиращи §§ 93-01, 93-10, 93-55 и 93-56"]
[null," 2. Друго финансиране - операции с пасиви (нето)",{"$nulls":3},{"$f":"+IF($P$2=0,$P117,0)","v":{"v":0,"d":"0 "}},{"$f":"+IF($P$2=0,$Q117,0)","v":{"v":0,"d":"0 "}},null,{"$f":"+IF(OR($P$2=98,$P$2=42,$P$2=96,$P$2=97),$P117,0)","v":{"v":0,"d":"0 "}},{"$f":"+IF(OR($P$2=98,$P$2=42,$P$2=96,$P$2=97),$Q117,0)","v":{"v":0,"d":"0 "}},null,{"$f":"+IF($P$2=33,$Q117,0)","v":{"v":0,"d":"0 "}},null,{"$f":"+ROUND(+G117+J117+L117,0)","v":{"v":0,"d":"0 "}},null,{"$f":"+ROUND(OTCHET!E559+OTCHET!E561,0)","v":{"v":0,"d":"0 "}},{"$f":"+ROUND(OTCHET!L559+OTCHET!L561,0)","v":{"v":0,"d":"0 "}},null,"финансиращи §§ 93-37 и 93-39"]
[null," Общо за група ІV. Други операции с финансови пасиви",{"$nulls":3},{"$f":"+ROUND(+SUM(F116:F117),0)","v":{"v":0,"d":"0 "}},{"$f":"+ROUND(+SUM(G116:G117),0)","v":{"v":0,"d":"0 "}},null,{"$f":"+ROUND(+SUM(I116:I117),0)","v":{"v":0,"d":"0 "}},{"$f":"+ROUND(+SUM(J116:J117),0)","v":{"v":0,"d":"0 "}},null,{"$f":"+ROUND(+SUM(L116:L117),0)","v":{"v":0,"d":"0 "}},null,{"$f":"+ROUND(+SUM(N116:N117),0)","v":{"v":0,"d":"0 "}},null,{"$f":"+ROUND(+SUM(P116:P117),0)","v":{"v":0,"d":"0 "}},{"$f":"+ROUND(+SUM(Q116:Q117),0)","v":{"v":0,"d":"0 "}},null,"Сборен ред за група ІV. Други операции с финансови пасиви"]
[]
[null," Ж. ОБЩО ОПЕРАЦИИ С ФИНАНСОВИ ПАСИВИ",{"$nulls":3},{"$f":"+ROUND(F106+F110+F114+F118,0)","v":{"v":0,"d":"0 "}},{"$f":"+ROUND(G106+G110+G114+G118,0)","v":{"v":0,"d":"0 "}},null,{"$f":"+ROUND(I106+I110+I114+I118,0)","v":{"v":0,"d":"0 "}},{"$f":"+ROUND(J106+J110+J114+J118,0)","v":{"v":0,"d":"0 "}},null,{"$f":"+ROUND(L106+L110+L114+L118,0)","v":{"v":0,"d":"0 "}},null,{"$f":"+ROUND(N106+N110+N114+N118,0)","v":{"v":0,"d":"0 "}},null,{"$f":"+ROUND(P106+P110+P114+P118,0)","v":{"v":0,"d":"0 "}},{"$f":"+ROUND(Q106+Q110+Q114+Q118,0)","v":{"v":0,"d":"0 "}},null," Сборен ред за Ж. ОБЩО ОПЕРАЦИИ С ФИНАНСОВИ ПАСИВИ"]
[null," З. НЕТО-РАЗЧЕТИ И ОПЕРАЦИИ",{"$nulls":16}," З. НЕТО-РАЗЧЕТИ И ОПЕРАЦИИ"]
[null," 1. Нето-операции за сметка на средства от Европейския съюз",{"$nulls":3},{"$f":"+IF($P$2=0,$P122,0)","v":{"v":0,"d":"0 "}},{"$f":"+IF($P$2=0,$Q122,0)","v":{"v":0,"d":"0 "}},null,{"$f":"+IF(OR($P$2=98,$P$2=42,$P$2=96,$P$2=97),$P122,0)","v":{"v":0,"d":"0 "}},{"$f":"+IF(OR($P$2=98,$P$2=42,$P$2=96,$P$2=97),$Q122,0)","v":{"v":0,"d":"0 "}},null,{"$f":"+IF($P$2=33,$Q122,0)","v":{"v":0,"d":"0 "}},null,{"$f":"+ROUND(+G122+J122+L122,0)","v":{"v":0,"d":"0 "}},null,{"$f":"+ROUND(+SUM(OTCHET!E549:E556),0)","v":{"v":0,"d":"0 "}},{"$f":"+ROUND(+SUM(OTCHET!L549:L556),0)","v":{"v":0,"d":"0 "}},null,"финансиращи §§ 93-21 ÷ 93-28"]
[null," 2. Операции за сметка на други бюджети, сметки и фондове",{"$nulls":3},{"$f":"+IF($P$2=0,$P123,0)","v":{"v":0,"d":"0 "}},{"$f":"+IF($P$2=0,$Q123,0)","v":{"v":0,"d":"0 "}},null,{"$f":"+IF(OR($P$2=98,$P$2=42,$P$2=96,$P$2=97),$P123,0)","v":{"v":4214,"d":"4,214 "}},{"$f":"+IF(OR($P$2=98,$P$2=42,$P$2=96,$P$2=97),$Q123,0)","v":{"v":4214,"d":"4,214 "}},null,{"$f":"+IF($P$2=33,$Q123,0)","v":{"v":0,"d":"0 "}},null,{"$f":"+ROUND(+G123+J123+L123,0)","v":{"v":4214,"d":"4,214 "}},null,{"$f":"+ROUND(OTCHET!E524,0)","v":{"v":4214,"d":"4,214 "}},{"$f":"+ROUND(OTCHET!L524,0)","v":{"v":4214,"d":"4,214 "}},null,"финансиращ § 88-00"]
[null," 3. Други нето-разчети и операции на бюджетни организации",{"$nulls":3},{"$f":"+IF($P$2=0,$P124,0)","v":{"v":0,"d":"0 "}},{"$f":"+IF($P$2=0,$Q124,0)","v":{"v":0,"d":"0 "}},null,{"$f":"+IF(OR($P$2=98,$P$2=42,$P$2=96,$P$2=97),$P124,0)","v":{"v":0,"d":"0 "}},{"$f":"+IF(OR($P$2=98,$P$2=42,$P$2=96,$P$2=97),$Q124,0)","v":{"v":0,"d":"0 "}},null,{"$f":"+IF($P$2=33,$Q124,0)","v":{"v":0,"d":"0 "}},null,{"$f":"+ROUND(+G124+J124+L124,0)","v":{"v":0,"d":"0 "}},null,{"$f":"+ROUND(+OTCHET!E521+OTCHET!E531+OTCHET!E557+OTCHET!E564+OTCHET!E565+OTCHET!E579+OTCHET!E591+IF(AND(OTCHET!$F$12=9900,+OTCHET!$E$15=0),+OTCHET!E586,0),0)","v":{"v":0,"d":"0 "}},{"$f":"+ROUND(+OTCHET!L521+OTCHET!L531+OTCHET!L557+OTCHET!L564+OTCHET!L565+OTCHET!L579+OTCHET!L591+IF(AND(OTCHET!$F$12=9900,+OTCHET!$E$15=0),+OTCHET!L586,0),0)","v":{"v":0,"d":"0 "}},null,"финансиращи §§ 87-00, 89-00, 93-30, 93-95, 93-96, 95-13 и 98-00 (за ЦБ - и § 96-01 и 96-02)"]
[null,"     в т.ч. изменение на средства по сметки, включени в единната сметка",{"$nulls":3},{"$f":"+IF($P$2=0,$P125,0)","v":{"v":0,"d":"0 "}},{"$f":"+IF($P$2=0,$Q125,0)","v":{"v":0,"d":"0 "}},{"$nulls":6},{"$f":"+ROUND(+G125+J125+L125,0)","v":{"v":0,"d":"0 "}},null,{"$f":"+ROUND(+IF(AND(OTCHET!$F$12=\"9900\",+OTCHET!$E$15=0,+(OTCHET!E589+OTCHET!E590)>0,+(OTCHET!E587+OTCHET!E588)<0),+OTCHET!E586,0),0)","v":{"v":0,"d":"0 "}},{"$f":"+ROUND(+IF(AND(OTCHET!$F$12=\"9900\",+OTCHET!$E$15=0,+(OTCHET!L589+OTCHET!L590)>=0,+(OTCHET!L587+OTCHET!L588)<=0),+OTCHET!L586,0),0)","v":{"v":0,"d":"0 "}},null,"финансиращ § 96-00"]
[null," 4. Разлики от закръгления в хил. лв. (+/-)",{"$nulls":11},{"$f":"+ROUND(+G126+J126+L126,0)","v":{"v":0,"d":"0 "}},{"$nulls":4},"прилага се само за отчета в хил. лв."]
[null," З. ОБЩО НЕТО-РАЗЧЕТИ И ДРУГИ ОПЕРАЦИИ",{"$nulls":3},{"$f":"+ROUND(+SUM(F122:F126),0)","v":{"v":0,"d":"0 "}},{"$f":"+ROUND(+SUM(G122:G126),0)","v":{"v":0,"d":"0 "}},null,{"$f":"+ROUND(+SUM(I122:I126),0)","v":{"v":4214,"d":"4,214 "}},{"$f":"+ROUND(+SUM(J122:J126),0)","v":{"v":4214,"d":"4,214 "}},null,{"$f":"+ROUND(+SUM(L122:L126),0)","v":{"v":0,"d":"0 "}},null,{"$f":"+ROUND(+SUM(N122:N126),0)","v":{"v":4214,"d":"4,214 "}},null,{"$f":"+ROUND(+SUM(P122:P126),0)","v":{"v":4214,"d":"4,214 "}},{"$f":"+ROUND(+SUM(Q122:Q126),0)","v":{"v":4214,"d":"4,214 "}},null," Сборен ред за З. ОБЩО НЕТО-РАЗЧЕТИ И ДРУГИ НЕТНИ ПОЗИЦИИ"]
[null," И. ИЗМЕНЕНИЕ НА ПАРИЧНИТЕ СРЕДСТВА",{"$nulls":16}," И. ИЗМЕНЕНИЕ НА ПАРИЧНИТЕ СРЕДСТВА"]
[null," 1. Наличности на парични средства в началото на отчетния период",{"$nulls":3},{"$f":"+IF($P$2=0,$P129,0)","v":{"v":0,"d":"0 "}},{"$f":"+IF($P$2=0,$Q129,0)","v":{"v":0,"d":"0 "}},null,{"$f":"+IF(OR($P$2=98,$P$2=42,$P$2=96,$P$2=97),$P129,0)","v":{"v":0,"d":"0 "}},{"$f":"+IF(OR($P$2=98,$P$2=42,$P$2=96,$P$2=97),$Q129,0)","v":{"v":0,"d":"0 "}},null,{"$f":"+IF($P$2=33,$Q129,0)","v":{"v":0,"d":"0 "}},null,{"$f":"+ROUND(+G129+J129+L129,0)","v":{"v":0,"d":"0 "}},null,{"$f":"+ROUND(+SUM(OTCHET!E567:E572)+SUM(OTCHET!E581:E582)+IF(AND(OTCHET!$F$12=9900,+OTCHET!$E$15=0),0,SUM(OTCHET!E587:E588)),0)","v":{"v":0,"d":"0 "}},{"$f":"+ROUND(+SUM(OTCHET!L567:L572)+SUM(OTCHET!L581:L582)+IF(AND(OTCHET!$F$12=9900,+OTCHET!$E$15=0),0,SUM(OTCHET!L587:L588)),0)","v":{"v":0,"d":"0 "}},null,"финансиращи §§ 95-01 ÷ 95-06, 95-21, 95-22, 96-01 и 96-03 (за ЦБ -  без § 96-01 и 96-03)"]
[null," 2. Преоценка на наличности в чудестранна валута в края на отчетния период",{"$nulls":3},{"$f":"+IF($P$2=0,$P130,0)","v":{"v":0,"d":"0 "}},{"$f":"+IF($P$2=0,$Q130,0)","v":{"v":0,"d":"0 "}},null,{"$f":"+IF(OR($P$2=98,$P$2=42,$P$2=96,$P$2=97),$P130,0)","v":{"v":0,"d":"0 "}},{"$f":"+IF(OR($P$2=98,$P$2=42,$P$2=96,$P$2=97),$Q130,0)","v":{"v":0,"d":"0 "}},null,{"$f":"+IF($P$2=33,$Q130,0)","v":{"v":0,"d":"0 "}},null,{"$f":"+ROUND(+G130+J130+L130,0)","v":{"v":0,"d":"0 "}},null,{"$f":"+ROUND(OTCHET!E580+OTCHET!E585,0)","v":{"v":0,"d":"0 "}},{"$f":"+ROUND(OTCHET!L580+OTCHET!L585,0)","v":{"v":0,"d":"0 "}},null,"финансиращи §§ 95-14 и 95-49"]
[null," 3. Наличности на парични средства в края на отчетния период",{"$nulls":3},{"$f":"+IF($P$2=0,$P131,0)","v":{"v":0,"d":"0 "}},{"$f":"+IF($P$2=0,$Q131,0)","v":{"v":0,"d":"0 "}},null,{"$f":"+IF(OR($P$2=98,$P$2=42,$P$2=96,$P$2=97),$P131,0)","v":{"v":0,"d":"0 "}},{"$f":"+IF(OR($P$2=98,$P$2=42,$P$2=96,$P$2=97),$Q131,0)","v":{"v":0,"d":"0 "}},null,{"$f":"+IF($P$2=33,$Q131,0)","v":{"v":0,"d":"0 "}},null,{"$f":"+ROUND(+G131+J131+L131,0)","v":{"v":0,"d":"0 "}},null,{"$f":"+ROUND(-SUM(OTCHET!E573:E578)-SUM(OTCHET!E583:E584)-IF(AND(OTCHET!$F$12=9900,+OTCHET!$E$15=0),0,SUM(OTCHET!E589:E590)),0)","v":{"v":0,"d":"0 "}},{"$f":"+ROUND(-SUM(OTCHET!L573:L578)-SUM(OTCHET!L583:L584)-IF(AND(OTCHET!$F$12=9900,+OTCHET!$E$15=0),0,SUM(OTCHET!L589:L590)),0)","v":{"v":0,"d":"0 "}},null,"(-) §§ 95-07 ÷ 95-12, 95-28, 95-29, 96-07 и 96-09 (за ЦБ - § без 96-07 и 96-09)"]
[null," И. ИЗМЕНЕНИЕ НА ПАРИЧНИТЕ СРЕДСТВА (3. - 1. - 2.)",{"$nulls":3},{"$f":"+ROUND(+F131-F129-F130,0)","v":{"v":0,"d":"0 "}},{"$f":"+ROUND(+G131-G129-G130,0)","v":{"v":0,"d":"0 "}},null,{"$f":"+ROUND(+I131-I129-I130,0)","v":{"v":0,"d":"0 "}},{"$f":"+ROUND(+J131-J129-J130,0)","v":{"v":0,"d":"0 "}},null,{"$f":"+ROUND(+L131-L129-L130,0)","v":{"v":0,"d":"0 "}},null,{"$f":"+ROUND(+N131-N129-N130,0)","v":{"v":0,"d":"0 "}},null,{"$f":"+ROUND(+P131-P129-P130,0)","v":{"v":0,"d":"0 "}},{"$f":"+ROUND(+Q131-Q129-Q130,0)","v":{"v":0,"d":"0 "}},null," Сборен ред за И. ИЗМЕНЕНИЕ НА ПАРИЧНИТЕ СРЕДСТВА (3. - 1. - 2.)"]
[null,{"$f":"+IF(+SUM(F133:N133)=0,0,\"Контрола: дефицит/излишък = финансиране с обратен знак (Г. + Д. = 0)\")","v":0},{"$nulls":3},{"$f":"+ROUND(F83,0)+ROUND(F84,0)","v":0},{"$f":"+ROUND(G83,0)+ROUND(G84,0)","v":0},null,{"$f":"+ROUND(I83,0)+ROUND(I84,0)","v":0},{"$f":"+ROUND(J83,0)+ROUND(J84,0)","v":0},null,{"$f":"+ROUND(L83,0)+ROUND(L84,0)","v":0},null,{"$f":"+ROUND(N83,0)+ROUND(N84,0)","v":0},null,{"$f":"+ROUND(P83,0)+ROUND(P84,0)","v":0},{"$f":"+ROUND(Q83,0)+ROUND(Q84,0)","v":0}]
[null,"                                                              Дата:",{"$f":"+OTCHET!B605","v":{"v":0,"d":"00.00.0000 г."}},"              ГЛ. СЧЕТОВОДИТЕЛ:",{"$nulls":4},"                          РЪКОВОДИТЕЛ:"]
[]
[]
[null,"КОНТРОЛА - РАВНЕНИЕ МЕЖДУ БЮДЖЕТНО САЛДО И ФИНАНСИРАНЕ",{"$nulls":3},{"$f":"+IF(+ROUND(F140,2)=0,\"O K\",\"НЕРАВНЕНИЕ!\")","v":"O K"},{"$f":"+IF(+ROUND(G140,2)=0,\"O K\",\"НЕРАВНЕНИЕ!\")","v":"O K"},null,{"$f":"+IF(+ROUND(I140,2)=0,\"O K\",\"НЕРАВНЕНИЕ!\")","v":"O K"},{"$f":"+IF(+ROUND(J140,2)=0,\"O K\",\"НЕРАВНЕНИЕ!\")","v":"O K"},null,{"$f":"+IF(+ROUND(L140,2)=0,\"O K\",\"НЕРАВНЕНИЕ!\")","v":"O K"},null,{"$f":"+IF(+ROUND(N140,2)=0,\"O K\",\"НЕРАВНЕНИЕ!\")","v":"O K"},null,{"$f":"+IF(+ROUND(P140,2)=0,\"O K\",\"НЕРАВНЕНИЕ!\")","v":"O K"},{"$f":"+IF(+ROUND(Q140,2)=0,\"O K\",\"НЕРАВНЕНИЕ!\")","v":"O K"}]
[null,"КОНТРОЛА - РАВНЕНИЕ НА КАСОВИ ПОТОЦИ С НАЛИЧНОСТ",{"$nulls":3},{"$f":"+IF(+ROUND(F141,0)=0,\"O K\",\"НЕРАВНЕНИЕ!\")","v":"O K"},{"$f":"+IF(+ROUND(G141,0)=0,\"O K\",\"НЕРАВНЕНИЕ!\")","v":"O K"},null,{"$f":"+IF(+ROUND(I141,0)=0,\"O K\",\"НЕРАВНЕНИЕ!\")","v":"O K"},{"$f":"+IF(+ROUND(J141,0)=0,\"O K\",\"НЕРАВНЕНИЕ!\")","v":"O K"},null,{"$f":"+IF(+ROUND(L141,0)=0,\"O K\",\"НЕРАВНЕНИЕ!\")","v":"O K"},null,{"$f":"+IF(+ROUND(N141,0)=0,\"O K\",\"НЕРАВНЕНИЕ!\")","v":"O K"},null,{"$f":"+IF(+ROUND(P141,0)=0,\"O K\",\"НЕРАВНЕНИЕ!\")","v":"O K"},{"$f":"+IF(+ROUND(Q141,0)=0,\"O K\",\"НЕРАВНЕНИЕ!\")","v":"O K"}]
[]
[null,"КОНТРОЛА - РАВНЕНИЕ НА БЮДЖ. САЛДО И ФИНАНСИРАНЕ - неравнение в левове",{"$nulls":3},{"$f":"+ROUND(F83,0)+ROUND(F84,0)","v":0},{"$f":"+ROUND(G83,0)+ROUND(G84,0)","v":0},null,{"$f":"+ROUND(I83,0)+ROUND(I84,0)","v":0},{"$f":"+ROUND(J83,0)+ROUND(J84,0)","v":0},null,{"$f":"+ROUND(L83,0)+ROUND(L84,0)","v":0},null,{"$f":"+ROUND(N83,0)+ROUND(N84,0)","v":0},null,{"$f":"+ROUND(P83,0)+ROUND(P84,0)","v":0},{"$f":"+ROUND(Q83,0)+ROUND(Q84,0)","v":0}]
[null,"КОНТРОЛА - РАВНЕНИЕ НА КАСОВИ ПОТОЦИ С НАЛИЧНОСТ - неравнение в левове",{"$nulls":3},{"$f":"SUM(+ROUND(F83,0)+ROUND(F101,0)+ROUND(F120,0)+ROUND(F127,0)+ROUND(F129,0)+ROUND(F130,0))-ROUND(F131,0)","v":0},{"$f":"SUM(+ROUND(G83,0)+ROUND(G101,0)+ROUND(G120,0)+ROUND(G127,0)+ROUND(G129,0)+ROUND(G130,0))-ROUND(G131,0)","v":0},null,{"$f":"SUM(+ROUND(I83,0)+ROUND(I101,0)+ROUND(I120,0)+ROUND(I127,0)+ROUND(I129,0)+ROUND(I130,0))-ROUND(I131,0)","v":0},{"$f":"SUM(+ROUND(J83,0)+ROUND(J101,0)+ROUND(J120,0)+ROUND(J127,0)+ROUND(J129,0)+ROUND(J130,0))-ROUND(J131,0)","v":0},null,{"$f":"SUM(+ROUND(L83,0)+ROUND(L101,0)+ROUND(L120,0)+ROUND(L127,0)+ROUND(L129,0)+ROUND(L130,0))-ROUND(L131,0)","v":0},null,{"$f":"SUM(+ROUND(N83,0)+ROUND(N101,0)+ROUND(N120,0)+ROUND(N127,0)+ROUND(N129,0)+ROUND(N130,0))-ROUND(N131,0)","v":0},null,{"$f":"SUM(+ROUND(P83,0)+ROUND(P101,0)+ROUND(P120,0)+ROUND(P127,0)+ROUND(P129,0)+ROUND(P130,0))-ROUND(P131,0)","v":0},{"$f":"SUM(+ROUND(Q83,0)+ROUND(Q101,0)+ROUND(Q120,0)+ROUND(Q127,0)+ROUND(Q129,0)+ROUND(Q130,0))-ROUND(Q131,0)","v":0}]

{"sheet":"OTCHET-agregirani pokazateli","index":1,"n_rows":114,"n_cols":11,"rows_kept":114,"merged":[[11,8,13,8],[16,4,17,4],[16,5,17,5],[107,6,107,7],[109,4,109,5],[113,4,113,5]]}
{"$rows_empty":7}
[null,{"$f":"VLOOKUP(E15,SMETKA,3,FALSE)","v":"ОТЧЕТ ЗА КАСОВОТО ИЗПЪЛНЕНИЕ НА СМЕТКИТЕ ЗА СРЕДСТВАТА ОТ ЕВРОПЕЙСКИЯ СЪЮЗ - КСФ"}]
[]
[]
[null,{"$f":"+OTCHET!B9","v":"ДЕТСКА ГРАДИНА \"НАРЦИС\""},null,null,"към",{"$f":"OTCHET!F9","v":"2020-06-30"},"ЕИК/БУЛСТАТ",{"$f":"OTCHET!H9","v":{"v":0,"d":"000 000 000"}},{"$f":"OTCHET!I9","v":0}]
[null,"                                  (наименование на разпоредителя с бюджет)",{"$nulls":6},"код от регистъра на бюджетните организации в СЕБРА"]
[null,{"$f":"+OTCHET!B12","v":"Силистра"},null,null,{"$f":"+OTCHET!E12","v":"код по ЕБК:"},{"$f":"+OTCHET!F12","v":"6905"}]
[null,"               (наименование на първостепенния разпоредител с бюджет)"]
[null,"финансово-правна форма",null,null,{"$f":"OTCHET!E15","v":98},{"$f":"OTCHET!F15","v":"СЕС - КСФ"}]
[]
[null,null,"§§",null,"Годишен         уточнен план                           2020 г.","ОТЧЕТ               2020 г.","                        ОТЧЕТНИ ДАННИ ЗА:",{"$nulls":3},"§§ от ЕБК, които се включват в съответния показател"]
[null,"П О К А З А Т Е Л И",{"$nulls":4},"държавни дейности","местни дейности","дофинансиране"]
[]
[null,"(а)",null,null,"(1)","(2)","(3)","(4)","(5)"]
[]
[10,"I. ПРИХОДИ, ПОМОЩИ И ДАРЕНИЯ ","§§ 01 - 48",null,{"$f":"+E23+E25+E36+E37","v":0},{"$f":"+F23+F25+F36+F37","v":0},{"$f":"+G23+G25+G36+G37","v":0},{"$f":"+H23+H25+H36+H37","v":0},{"$f":"+I23+I25+I36+I37","v":0},null,"§§ 01 - 48"]
[15,"1. Данъчни приходи","§§ 01 - 20  ",null,{"$f":"OTCHET!E22+OTCHET!E28+OTCHET!E33+OTCHET!E39+OTCHET!E47+OTCHET!E52+OTCHET!E58+OTCHET!E61+OTCHET!E64+OTCHET!E65+OTCHET!E72+OTCHET!E73","v":0},{"$f":"+G23+H23+I23","v":0},{"$f":"OTCHET!I22+OTCHET!I28+OTCHET!I33+OTCHET!I39+OTCHET!I47+OTCHET!I52+OTCHET!I58+OTCHET!I61+OTCHET!I64+OTCHET!I65+OTCHET!I72+OTCHET!I73","v":0},{"$f":"OTCHET!J22+OTCHET!J28+OTCHET!J33+OTCHET!J39+OTCHET!J47+OTCHET!J52+OTCHET!J58+OTCHET!J61+OTCHET!J64+OTCHET!J65+OTCHET!J72+OTCHET!J73","v":0},{"$f":"OTCHET!K22+OTCHET!K28+OTCHET!K33+OTCHET!K39+OTCHET!K47+OTCHET!K52+OTCHET!K58+OTCHET!K61+OTCHET!K64+OTCHET!K65+OTCHET!K72+OTCHET!K73","v":0},null,"§§ 01 - 20  "]
[null,"в т. ч. трансфери за отчислени приходи","§ 65",null,null,{"$f":"+G24+H24+I24","v":0},{"$nulls":4},"§ 65"]
[20,"2. Други приходи","§§ 24 - 42",null,{"$f":"+E26+E30+E31+E32+E33","v":0},{"$f":"+F26+F30+F31+F32+F33","v":0},{"$f":"+G26+G30+G31+G32+G33","v":0},{"$f":"+H26+H30+H31+H32+H33","v":0},{"$f":"+I26+I30+I31+I32+I33","v":0},null,"§§ 24 - 42"]
[25,"2.1 Приходи и доходи от собственост ","§24",null,{"$f":"OTCHET!E74","v":0},{"$f":"+G26+H26+I26","v":0},{"$f":"OTCHET!I74","v":0},{"$f":"OTCHET!J74","v":0},{"$f":"OTCHET!K74","v":0},null,"§24"]
[26,"в т. ч.   вноски от приходи на държавни и общински предприятия и институции","под.§ 24-01",null,{"$f":"OTCHET!E75","v":0},0,{"$f":"OTCHET!I75","v":0},{"$f":"OTCHET!J75","v":0},{"$f":"OTCHET!K75","v":0},null,"под.§ 24-01"]
[30,"             нетни приходи от продажба на услуги, стоки и продукция","под.§ 24-04",null,{"$f":"OTCHET!E77","v":0},0,{"$f":"OTCHET!I77","v":0},{"$f":"OTCHET!J77","v":0},{"$f":"OTCHET!K77","v":0},null,"под.§ 24-04"]
[35,"             приходи от наеми на имущество и земя ","под.§§ 24-05 и 24-06",null,{"$f":"+OTCHET!E78+OTCHET!E79","v":0},0,{"$f":"+OTCHET!I78+OTCHET!I79","v":0},{"$f":"+OTCHET!J78+OTCHET!J79","v":0},{"$f":"+OTCHET!K78+OTCHET!K79","v":0},null,"под.§§ 24-05 и 24-06"]
[40,"2.2 Приходи от такси","§§ 25 - 27",null,{"$f":"OTCHET!E90+OTCHET!E93+OTCHET!E94","v":0},0,{"$f":"OTCHET!I90+OTCHET!I93+OTCHET!I94","v":0},{"$f":"OTCHET!J90+OTCHET!J93+OTCHET!J94","v":0},{"$f":"OTCHET!K90+OTCHET!K93+OTCHET!K94","v":0},null,"§§ 25 - 27"]
[45,"2.3 Глоби, санкции и наказателни лихви ","§28",null,{"$f":"OTCHET!E108","v":0},0,{"$f":"OTCHET!I108","v":0},{"$f":"OTCHET!J108","v":0},{"$f":"OTCHET!K108","v":0},null,"§28"]
[50,"2.4  Други неданъчни приходи ","§§ 36 - 37 и §§ 41 - 42",null,{"$f":"OTCHET!E112+OTCHET!E121+OTCHET!E137+OTCHET!E138","v":0},0,{"$f":"OTCHET!I112+OTCHET!I121+OTCHET!I137+OTCHET!I138","v":0},{"$f":"OTCHET!J112+OTCHET!J121+OTCHET!J137+OTCHET!J138","v":0},{"$f":"OTCHET!K112+OTCHET!K121+OTCHET!K137+OTCHET!K138","v":0},null,"§§ 36 - 37 и §§ 41 - 42"]
[51,"2.5  Постъпления от продажба на нефинансови активи","§ 40 с изключение на под.§ 40-71",null,{"$f":"OTCHET!E125","v":0},0,{"$f":"OTCHET!I125","v":0},{"$f":"OTCHET!J125","v":0},{"$f":"OTCHET!K125","v":0},null,"§ 40 с изключение на под.§ 40-71"]
[52,{"$nulls":4},0]
[{"$nulls":5},0]
[60,"3. Помощи и  дарения от страната","§ 45 ",null,{"$f":"+OTCHET!E139","v":0},0,{"$f":"+OTCHET!I139","v":0},{"$f":"+OTCHET!J139","v":0},{"$f":"+OTCHET!K139","v":0},null,"§ 45 "]
[65,"4. Помощи и дарения от чужбина","§§ 46 - 48  ",null,{"$f":"OTCHET!E142+OTCHET!E151+OTCHET!E160","v":0},0,{"$f":"OTCHET!I142+OTCHET!I151+OTCHET!I160","v":0},{"$f":"OTCHET!J142+OTCHET!J151+OTCHET!J160","v":0},{"$f":"OTCHET!K142+OTCHET!K151+OTCHET!K160","v":0},null,"§§ 46 - 48  "]
[70,"II. РАЗХОДИ ","§§ 01 - 57",null,{"$f":"E39+E43+E44+E46+SUM(E48:E52)+E55","v":{"v":16504,"d":"16,504"}},{"$f":"F39+F43+F44+F46+SUM(F48:F52)+F55","v":{"v":16504,"d":"16,504"}},{"$f":"G39+G43+G44+G46+SUM(G48:G52)+G55","v":{"v":16504,"d":"16,504"}},{"$f":"H39+H43+H44+H46+SUM(H48:H52)+H55","v":0},{"$f":"I39+I43+I44+I46+SUM(I48:I52)+I55","v":0},null,"§§ 01 - 57"]
[null,"1. Персонал",null,null,{"$f":"SUM(E40:E42)","v":{"v":15741,"d":"15,741"}},{"$f":"SUM(F40:F42)","v":{"v":15741,"d":"15,741"}},{"$f":"SUM(G40:G42)","v":{"v":15741,"d":"15,741"}},{"$f":"SUM(H40:H42)","v":0},{"$f":"SUM(I40:I42)","v":0},null,"§§ 1 - 8"]
[75,"1.1. Заплати и възнаграждения за персонала, нает по трудови и служебни прав. ","§ 01",null,{"$f":"OTCHET!E187","v":{"v":12491,"d":"12,491"}},{"$f":"+G40+H40+I40","v":{"v":12491,"d":"12,491"}},{"$f":"OTCHET!I187","v":{"v":12491,"d":"12,491"}},{"$f":"OTCHET!J187","v":0},{"$f":"OTCHET!K187","v":0},null,"§ 01"]
[80,"1.2. Други възнаграждения и плащания за персонала ","§ 02",null,{"$f":"OTCHET!E190","v":683},683,{"$f":"OTCHET!I190","v":683},{"$f":"OTCHET!J190","v":0},{"$f":"OTCHET!K190","v":0},null,"§ 02"]
[85,"1.3. Осигурителни вноски","§§ 05 и 08",null,{"$f":"+OTCHET!E196+OTCHET!E204","v":{"v":2567,"d":"2,567"}},{"v":2567,"d":"2,567"},{"$f":"+OTCHET!I196+OTCHET!I204","v":{"v":2567,"d":"2,567"}},{"$f":"+OTCHET!J196+OTCHET!J204","v":0},{"$f":"+OTCHET!K196+OTCHET!K204","v":0},null,"§§ 05 и 08"]
[90,"2. Издръжка ","§§ 10; 19; 46",null,{"$f":"+OTCHET!E205+OTCHET!E223+OTCHET!E271","v":483},483,{"$f":"+OTCHET!I205+OTCHET!I223+OTCHET!I271","v":483},{"$f":"+OTCHET!J205+OTCHET!J223+OTCHET!J271","v":0},{"$f":"+OTCHET!K205+OTCHET!K223+OTCHET!K271","v":0},null,"§§ 10; 19; 46"]
[95,"3. Лихви ","§§ 21 - 29",null,{"$f":"+OTCHET!E227+OTCHET!E233+OTCHET!E236+OTCHET!E237+OTCHET!E238+OTCHET!E239+OTCHET!E240","v":0},0,{"$f":"+OTCHET!I227+OTCHET!I233+OTCHET!I236+OTCHET!I237+OTCHET!I238+OTCHET!I239+OTCHET!I240","v":0},{"$f":"+OTCHET!J227+OTCHET!J233+OTCHET!J236+OTCHET!J237+OTCHET!J238+OTCHET!J239+OTCHET!J240","v":0},{"$f":"+OTCHET!K227+OTCHET!K233+OTCHET!K236+OTCHET!K237+OTCHET!K238+OTCHET!K239+OTCHET!K240","v":0},null,"§§ 21 - 29"]
[100,"в т. ч. външни ","§§ 25 - 28; 29-69/29-70 и 29-92 ",null,{"$f":"+OTCHET!E236+OTCHET!E237+OTCHET!E238+OTCHET!E239+OTCHET!E243+OTCHET!E244+OTCHET!E248","v":0},0,{"$f":"+OTCHET!I236+OTCHET!I237+OTCHET!I238+OTCHET!I239+OTCHET!I243+OTCHET!I244+OTCHET!I248","v":0},{"$f":"+OTCHET!J236+OTCHET!J237+OTCHET!J238+OTCHET!J239+OTCHET!J243+OTCHET!J244+OTCHET!J248","v":0},{"$f":"+OTCHET!K236+OTCHET!K237+OTCHET!K238+OTCHET!K239+OTCHET!K243+OTCHET!K244+OTCHET!K248","v":0},null,"§§ 25 - 28; 29-69/29-70 и 29-92 "]
[105,"4. Социални разходи, стипендии","§§ 39 - 42",null,{"$f":"+OTCHET!E255+OTCHET!E256+OTCHET!E257+OTCHET!E258","v":280},280,{"$f":"+OTCHET!I255+OTCHET!I256+OTCHET!I257+OTCHET!I258","v":280},{"$f":"+OTCHET!J255+OTCHET!J256+OTCHET!J257+OTCHET!J258","v":0},{"$f":"+OTCHET!K255+OTCHET!K256+OTCHET!K257+OTCHET!K258","v":0},null,"§§ 39 - 42"]
[106,"в т. ч. стипендии","§ 40",null,{"$f":"+OTCHET!E256","v":0},0,{"$f":"+OTCHET!I256","v":0},{"$f":"+OTCHET!J256","v":0},{"$f":"+OTCHET!K256","v":0},null,"§ 40"]
[107,"5.Субсидии ","§§ 43 - 45; 49",null,{"$f":"+OTCHET!E265+OTCHET!E269+OTCHET!E270","v":0},0,{"$f":"+OTCHET!I265+OTCHET!I269+OTCHET!I270","v":0},{"$f":"+OTCHET!J265+OTCHET!J269+OTCHET!J270","v":0},{"$f":"+OTCHET!K265+OTCHET!K269+OTCHET!K270","v":0},null,"§§ 43 - 45"]
[108,"6. Придобиване на нeфинансови актииви","§§ 51 - 54",null,{"$f":"OTCHET!E275+OTCHET!E276+OTCHET!E284+OTCHET!E287","v":0},0,{"$f":"OTCHET!I275+OTCHET!I276+OTCHET!I284+OTCHET!I287","v":0},{"$f":"OTCHET!J275+OTCHET!J276+OTCHET!J284+OTCHET!J287","v":0},{"$f":"OTCHET!K275+OTCHET!K276+OTCHET!K284+OTCHET!K287","v":0},null,"§§ 51 - 54"]
[110,"7. Капиталови трансфери","§ 55",null,{"$f":"+OTCHET!E288","v":0},0,{"$f":"+OTCHET!I288","v":0},{"$f":"+OTCHET!J288","v":0},{"$f":"+OTCHET!K288","v":0},null,"§ 55"]
[null,"8. Предоставени текущи и капиталови трансфери за чужбина",null,null,{"$f":"+OTCHET!E272","v":0},{"$f":"+G51+H51+I51","v":0},{"$f":"+OTCHET!I272","v":0},{"$f":"+OTCHET!J272","v":0},{"$f":"+OTCHET!K272","v":0},null,"§ 49"]
[115,"9. Прираст на държавния резерв и изкупуване на земеделска продукция ","(+ § 57 - под.§ 40-71)",null,{"$f":"+OTCHET!E293","v":0},0,{"$f":"+OTCHET!I293","v":0},{"$f":"+OTCHET!J293","v":0},{"$f":"+OTCHET!K293","v":0},null,"(+ § 57 - под.§ 40-71)"]
[120,"в т. ч. плащания за попълване на държавния резерв","под.§;57-01",null,{"$f":"OTCHET!E294","v":0},0,{"$f":"OTCHET!I294","v":0},{"$f":"OTCHET!J294","v":0},{"$f":"OTCHET!K294","v":0},null,"под.§;57-01"]
[125,"          постъпления от продажби на държавния резерв (-)","(-)под.§ 40-71",null,{"$f":"OTCHET!E296","v":0},0,{"$f":"OTCHET!I296","v":0},{"$f":"OTCHET!J296","v":0},{"$f":"OTCHET!K296","v":0},null,"(-)под.§ 40-71"]
[127,"10. Резерв за непредвидини и неотложни разходи","§;00-98",null,{"$f":"+OTCHET!E297","v":0},0,{"$f":"+OTCHET!I297","v":0},{"$f":"+OTCHET!J297","v":0},{"$f":"+OTCHET!K297","v":0},null,"§;00-98"]
[130,"III. Трансфери","§§ 30 - 31; 32; 60 - 67; 69; 74 - 78 ",null,{"$f":"+E57+E58+E62","v":{"v":12290,"d":"12,290"}},{"$f":"+F57+F58+F62","v":{"v":12290,"d":"12,290"}},{"$f":"+G57+G58+G62","v":{"v":12290,"d":"12,290"}},{"$f":"+H57+H58+H62","v":0},{"$f":"+I57+I58+I62","v":0},null,"§§ 30 - 31; 32; 60 - 67; 69; 74 - 78 "]
[135,"1. Трансфери от/за ЦБ за/от други бюджети ","§§ 30 - 31; 60",null,{"$f":"+OTCHET!E361+OTCHET!E375+OTCHET!E388","v":0},{"$f":"+G57+H57+I57","v":0},{"$f":"+OTCHET!I361+OTCHET!I375+OTCHET!I388","v":0},{"$f":"+OTCHET!J361+OTCHET!J375+OTCHET!J388","v":0},{"$f":"+OTCHET!K361+OTCHET!K375+OTCHET!K388","v":0},null,"§§ 30 - 31; 60"]
[140,"2. Други трансфери ","§§ 32; 61- 67;  74 - 78",null,{"$f":"+OTCHET!E383+OTCHET!E391+OTCHET!E396+OTCHET!E399+OTCHET!E402+OTCHET!E405+OTCHET!E406+OTCHET!E409+OTCHET!E422+OTCHET!E423+OTCHET!E424+OTCHET!E425+OTCHET!E426","v":{"v":12290,"d":"12,290"}},{"v":12290,"d":"12,290"},{"$f":"+OTCHET!I383+OTCHET!I391+OTCHET!I396+OTCHET!I399+OTCHET!I402+OTCHET!I405+OTCHET!I406+OTCHET!I409+OTCHET!I422+OTCHET!I423+OTCHET!I424+OTCHET!I425+OTCHET!I426","v":{"v":12290,"d":"12,290"}},{"$f":"+OTCHET!J383+OTCHET!J391+OTCHET!J396+OTCHET!J399+OTCHET!J402+OTCHET!J405+OTCHET!J406+OTCHET!J409+OTCHET!J422+OTCHET!J423+OTCHET!J424+OTCHET!J425+OTCHET!J426","v":0},{"$f":"+OTCHET!K383+OTCHET!K391+OTCHET!K396+OTCHET!K399+OTCHET!K402+OTCHET!K405+OTCHET!K406+OTCHET!K409+OTCHET!K422+OTCHET!K423+OTCHET!K424+OTCHET!K425+OTCHET!K426","v":0},null,"§§ 32; 61- 67;  74 - 78"]
[145,"в т. ч. временни безлихвени заеми","§§ 74 - 78",null,{"$f":"+OTCHET!E422+OTCHET!E423+OTCHET!E424+OTCHET!E425+OTCHET!E426","v":0},0,{"$f":"+OTCHET!I422+OTCHET!I423+OTCHET!I424+OTCHET!I425+OTCHET!I426","v":0},{"$f":"+OTCHET!J422+OTCHET!J423+OTCHET!J424+OTCHET!J425+OTCHET!J426","v":0},{"$f":"+OTCHET!K422+OTCHET!K423+OTCHET!K424+OTCHET!K425+OTCHET!K426","v":0},null,"§§ 74 - 78"]
[150,"         трансфери за отчислени постъпления","§ 65",null,{"$f":"OTCHET!E405","v":0},0,{"$f":"OTCHET!I405","v":0},{"$f":"OTCHET!J405","v":0},{"$f":"OTCHET!K405","v":0},null,"§ 65"]
[160,{"$nulls":4},0]
[162,"3. Трансфери за поети осигурителни вноски и данъци","§ 69",null,{"$f":"OTCHET!E412","v":0},0,{"$f":"OTCHET!I412","v":0},{"$f":"OTCHET!J412","v":0},{"$f":"OTCHET!K412","v":0},null,"§ 69"]
[165,"IV. Вноска в общия бюджет на ЕС","§ 33",null,{"$f":"+OTCHET!E249","v":0},0,{"$f":"+OTCHET!I249","v":0},{"$f":"+OTCHET!J249","v":0},{"$f":"+OTCHET!K249","v":0},null,"§ 33"]
[175,"V. Дефицит / излишък = I - II +III - IV ",null,null,{"$f":"+E22-E38+E56-E63","v":{"v":-4214,"d":"(4,214)"}},{"$f":"+F22-F38+F56-F63","v":{"v":-4214,"d":"(4,214)"}},{"$f":"+G22-G38+G56-G63","v":{"v":-4214,"d":"(4,214)"}},{"$f":"+H22-H38+H56-H63","v":0},{"$f":"+I22-I38+I56-I63","v":0}]
[180,{"$f":"+IF(+SUM(E$65:I$65)=0,0,\"Контрола: дефицит/излишък = финансиране с обратен знак (V. + VІ. = 0)\")","v":0},null,null,{"$f":"+E$64+E$66","v":0},{"$f":"+F$64+F$66","v":0},{"$f":"+G$64+G$66","v":0},{"$f":"+H$64+H$66","v":0},{"$f":"+I$64+I$66","v":0}]
[185,"VI. Финансиране ","§§ 70 - 98",null,{"$f":"SUM(+E68+E76+E77+E84+E85+E86+E89+E90+E91+E92+E93+E94+E95)","v":{"v":4214,"d":"4,214"}},{"$f":"SUM(+F68+F76+F77+F84+F85+F86+F89+F90+F91+F92+F93+F94+F95)","v":{"v":4214,"d":"4,214"}},{"$f":"SUM(+G68+G76+G77+G84+G85+G86+G89+G90+G91+G92+G93+G94+G95)","v":{"v":4214,"d":"4,214"}},{"$f":"SUM(+H68+H76+H77+H84+H85+H86+H89+H90+H91+H92+H93+H94+H95)","v":0},{"$f":"SUM(+I68+I76+I77+I84+I85+I86+I89+I90+I91+I92+I93+I94+I95)","v":0},null,"§§ 70 - 98"]
[190,{"$nulls":4},{"$f":"+G67+H67+I67","v":0}]
[195,"1. Външно финансиране","§§ 80 - 82; 92-01; 95-21/95-22; 95-28/95-29 и 95-49",null,{"$f":"SUM(E69:E75)","v":0},{"$f":"SUM(F69:F75)","v":0},{"$f":"SUM(G69:G75)","v":0},{"$f":"SUM(H69:H75)","v":0},{"$f":"SUM(I69:I75)","v":0},null,"§§ 80 - 82; 92-01; 95-21/95-22; 95-28/95-29 и 95-49"]
[200,"            получени външни заеми ","под.§§ 80-11/80-12; 80-31/80-32; 80-51/80-52 и 80-97",null,{"$f":"+OTCHET!E482+OTCHET!E483+OTCHET!E486+OTCHET!E487+OTCHET!E490+OTCHET!E491+OTCHET!E495","v":0},{"$f":"+G69+H69+I69","v":0},{"$f":"+OTCHET!I482+OTCHET!I483+OTCHET!I486+OTCHET!I487+OTCHET!I490+OTCHET!I491+OTCHET!I495","v":0},{"$f":"+OTCHET!J482+OTCHET!J483+OTCHET!J486+OTCHET!J487+OTCHET!J490+OTCHET!J491+OTCHET!J495","v":0},{"$f":"+OTCHET!K482+OTCHET!K483+OTCHET!K486+OTCHET!K487+OTCHET!K490+OTCHET!K491+OTCHET!K495","v":0},null,"под.§§ 80-11/80-12; 80-31/80-32; 80-51/80-52 и 80-97"]
[205,"            погашения по външни заеми ","под.§§ 80-17/80-18; 80-37/80-38; 80-57/80-58; 80-80 и 80-98;",null,{"$f":"+OTCHET!E484+OTCHET!E485+OTCHET!E488+OTCHET!E489+OTCHET!E492+OTCHET!E493+OTCHET!E494+OTCHET!E496","v":0},0,{"$f":"+OTCHET!I484+OTCHET!I485+OTCHET!I488+OTCHET!I489+OTCHET!I492+OTCHET!I493+OTCHET!I494+OTCHET!I496","v":0},{"$f":"+OTCHET!J484+OTCHET!J485+OTCHET!J488+OTCHET!J489+OTCHET!J492+OTCHET!J493+OTCHET!J494+OTCHET!J496","v":0},{"$f":"+OTCHET!K484+OTCHET!K485+OTCHET!K488+OTCHET!K489+OTCHET!K492+OTCHET!K493+OTCHET!K494+OTCHET!K496","v":0},null,"под.§§ 80-17/80-18; 80-37/80-38; 80-57/80-58; 80-80 и 80-98;"]
[210,"            държавни /общински/ ЦК емитирани на м/нар. капиталови пазари ","§ 81",null,{"$f":"+OTCHET!E497","v":0},0,{"$f":"+OTCHET!I497","v":0},{"$f":"+OTCHET!J497","v":0},{"$f":"+OTCHET!K497","v":0},null,"§ 81"]
[215,"            получени погашения по предоставени кредити от други държави ","§ 82",null,{"$f":"+OTCHET!E502","v":0},0,{"$f":"+OTCHET!I502","v":0},{"$f":"+OTCHET!J502","v":0},{"$f":"+OTCHET!K502","v":0},null,"§ 82"]
[220,"            операции с др. ЦК и финансови активи ","под. § 92-01",null,{"$f":"+OTCHET!E542","v":0},0,{"$f":"+OTCHET!I542","v":0},{"$f":"+OTCHET!J542","v":0},{"$f":"+OTCHET!K542","v":0},null,"под. § 92-01"]
[230,"            остатък в лв.равн. по валутни сметки и каса в чужбина от предх. период ","под. §§ 95-21и 95-22",null,{"$f":"+OTCHET!E581+OTCHET!E582","v":0},0,{"$f":"+OTCHET!I581+OTCHET!I582","v":0},{"$f":"+OTCHET!J581+OTCHET!J582","v":0},{"$f":"+OTCHET!K581+OTCHET!K582","v":0},null,"под. §§ 95-21и 95-22"]
[235,"            наличности  в лв. равн.по валутни сметки и каса в чужб. в кр.на периода ","под. §§ 95-28/95-29 и 95-49",null,{"$f":"+OTCHET!E583+OTCHET!E584+OTCHET!E585","v":0},0,{"$f":"+OTCHET!I583+OTCHET!I584+OTCHET!I585","v":0},{"$f":"+OTCHET!J583+OTCHET!J584+OTCHET!J585","v":0},{"$f":"+OTCHET!K583+OTCHET!K584+OTCHET!K585","v":0},null,"под. §§ 95-28/95-29 и 95-49"]
[240,"2. Придобиване на дялове, акции, съучастия и др, финансови активи ","§ 70",null,{"$f":"OTCHET!E461","v":0},0,{"$f":"OTCHET!I461","v":0},{"$f":"OTCHET!J461","v":0},{"$f":"OTCHET!K461","v":0},null,"§ 70"]
[245,"3. Възмездни средства","§§ 71 - 73 и 79",null,{"$f":"SUM(E78:E83)","v":0},{"$f":"SUM(F78:F83)","v":0},{"$f":"SUM(G78:G83)","v":0},{"$f":"SUM(H78:H83)","v":0},{"$f":"SUM(I78:I83)","v":0},null,"§§ 71 - 73 и 79"]
[250,"            предоставени ","под. § 71-01 и § 72-01",null,{"$f":"+OTCHET!E466+OTCHET!E469","v":0},{"$f":"+G78+H78+I78","v":0},{"$f":"+OTCHET!I466+OTCHET!I469","v":0},{"$f":"+OTCHET!J466+OTCHET!J469","v":0},{"$f":"+OTCHET!K466+OTCHET!K469","v":0},null,"под. § 71-01 и § 72-01"]
[260,"            възстановени","под. § 71-02 и § 72-02 ",null,{"$f":"+OTCHET!E467+OTCHET!E470","v":0},0,{"$f":"+OTCHET!I467+OTCHET!I470","v":0},{"$f":"+OTCHET!J467+OTCHET!J470","v":0},{"$f":"+OTCHET!K467+OTCHET!K470","v":0},null,"под. § 71-02 и § 72-02 "]
[265,"            нето плащания по активирани гаранции, поръчителства и преоформен дълг "," § 73",null,{"$f":"OTCHET!E471","v":0},0,{"$f":"OTCHET!I471","v":0},{"$f":"OTCHET!J471","v":0},{"$f":"OTCHET!K471","v":0},null," § 73"]
[{"$nulls":5},0]
[270,"            предоставени заеми към крайни бенифициенти","под. § 79-01",null,{"$f":"+OTCHET!E479","v":0},0,{"$f":"+OTCHET!I479","v":0},{"$f":"+OTCHET!J479","v":0},{"$f":"+OTCHET!K479","v":0},null,"под. § 79-01"]
[275,"            възстановени суми по заеми от крайни бенифициенти","под. § 79-02",null,{"$f":"+OTCHET!E480","v":0},0,{"$f":"+OTCHET!I480","v":0},{"$f":"+OTCHET!J480","v":0},{"$f":"+OTCHET!K480","v":0},null,"под. § 79-02"]
[280,"4. Приватизация на дялове, акции и участия","§ 90",null,{"$f":"OTCHET!E535","v":0},0,{"$f":"OTCHET!I535","v":0},{"$f":"OTCHET!J535","v":0},{"$f":"OTCHET!K535","v":0},null,"§ 90"]
[285,"5. Покупко-продажба на държавни/общински/ ценни книжа от бюдж. предприятия ","§ 91",null,{"$f":"OTCHET!E536","v":0},0,{"$f":"OTCHET!I536","v":0},{"$f":"OTCHET!J536","v":0},{"$f":"OTCHET!K536","v":0},null,"§ 91"]
[290,"6. Друго вътрешно финансиране ","§§ 83; 85 - 88; 92-02; 93",null,{"$f":"+E87+E88","v":{"v":4214,"d":"4,214"}},{"$f":"+F87+F88","v":{"v":4214,"d":"4,214"}},{"$f":"+G87+G88","v":{"v":4214,"d":"4,214"}},{"$f":"+H87+H88","v":0},{"$f":"+I87+I88","v":0},null,"§§ 83; 85 - 88; 92-02; 93"]
[295,"            операции по вътрешен дълг и финан. активи- нето ","§§ 83; 85 - 86 и 92-02",null,{"$f":"+OTCHET!E503+OTCHET!E512+OTCHET!E516+OTCHET!E543","v":0},{"$f":"+G87+H87+I87","v":0},{"$f":"+OTCHET!I503+OTCHET!I512+OTCHET!I516+OTCHET!I543","v":0},{"$f":"+OTCHET!J503+OTCHET!J512+OTCHET!J516+OTCHET!J543","v":0},{"$f":"+OTCHET!K503+OTCHET!K512+OTCHET!K516+OTCHET!K543","v":0},null,"§§ 83; 85 - 86 и 92-02"]
[300,"            друго финансиране ","§§ 87; 88 и 93",null,{"$f":"+OTCHET!E521+OTCHET!E524+OTCHET!E544","v":{"v":4214,"d":"4,214"}},{"v":4214,"d":"4,214"},{"$f":"+OTCHET!I521+OTCHET!I524+OTCHET!I544","v":{"v":4214,"d":"4,214"}},{"$f":"+OTCHET!J521+OTCHET!J524+OTCHET!J544","v":0},{"$f":"+OTCHET!K521+OTCHET!K524+OTCHET!K544","v":0},null,"§§ 87; 88 и 93"]
[310,"7.Суми по разчети за поети осигур, вноски и данъци","§89",null,{"$f":"OTCHET!E531","v":0},0,{"$f":"OTCHET!I531","v":0},{"$f":"OTCHET!J531","v":0},{"$f":"OTCHET!K531","v":0},null,"§89"]
[320,"8. Наличности в началото на периода ","под. §§ 95-01 до 95-06",null,{"$f":"+OTCHET!E567+OTCHET!E568+OTCHET!E569+OTCHET!E570+OTCHET!E571+OTCHET!E572","v":0},0,{"$f":"+OTCHET!I567+OTCHET!I568+OTCHET!I569+OTCHET!I570+OTCHET!I571+OTCHET!I572","v":0},{"$f":"+OTCHET!J567+OTCHET!J568+OTCHET!J569+OTCHET!J570+OTCHET!J571+OTCHET!J572","v":0},{"$f":"+OTCHET!K567+OTCHET!K568+OTCHET!K569+OTCHET!K570+OTCHET!K571+OTCHET!K572","v":0},null,"под. §§ 95-01 до 95-06"]
[330,"9 Наличности в края на периода ","под. §§ 95-07 до 95-13",null,{"$f":"+OTCHET!E573+OTCHET!E574+OTCHET!E575+OTCHET!E576+OTCHET!E577+OTCHET!E578+OTCHET!E579","v":0},0,{"$f":"+OTCHET!I573+OTCHET!I574+OTCHET!I575+OTCHET!I576+OTCHET!I577+OTCHET!I578+OTCHET!I579","v":0},{"$f":"+OTCHET!J573+OTCHET!J574+OTCHET!J575+OTCHET!J576+OTCHET!J577+OTCHET!J578+OTCHET!J579","v":0},{"$f":"+OTCHET!K573+OTCHET!K574+OTCHET!K575+OTCHET!K576+OTCHET!K577+OTCHET!K578+OTCHET!K579","v":0},null,"под. §§ 95-07 до 95-13"]
[335,"10. Преоценка на валутни наличности ","под. § 95-14",null,{"$f":"+OTCHET!E580","v":0},0,{"$f":"+OTCHET!I580","v":0},{"$f":"+OTCHET!J580","v":0},{"$f":"+OTCHET!K580","v":0},null,"под. § 95-14"]
[340,"11. Депозити и сметки консолидирани в \"Единната сметка\" от предх. период ","под. §§ 96-01 до 96-03",null,{"$f":"+OTCHET!E587+OTCHET!E588","v":0},0,{"$f":"+OTCHET!I587+OTCHET!I588","v":0},{"$f":"+OTCHET!J587+OTCHET!J588","v":0},{"$f":"+OTCHET!K587+OTCHET!K588","v":0},null,"под. §§ 96-01 до 96-03"]
[345,"12. Депозити и сметки консолидирани в \"Единната сметка\" в края на периода","под. §§ 96-07 до 96-09",null,{"$f":"+OTCHET!E589+OTCHET!E590","v":0},0,{"$f":"+OTCHET!I589+OTCHET!I590","v":0},{"$f":"+OTCHET!J589+OTCHET!J590","v":0},{"$f":"+OTCHET!K589+OTCHET!K590","v":0},null,"под. §§ 96-07 до 96-09"]
[350,"13. Касови операции, депозити, покупко-продажба на валута и сетълмент ","§ 98",null,{"$f":"OTCHET!E591","v":0},0,{"$f":"OTCHET!I591","v":0},{"$f":"OTCHET!J591","v":0},{"$f":"OTCHET!K591","v":0},null,"§ 98"]
[355,"            в т. ч. покупко-продажба на валута (+/-) ","под. § 98-30",null,{"$f":"+OTCHET!E594","v":0},0,{"$f":"+OTCHET!I594","v":0},{"$f":"+OTCHET!J594","v":0},{"$f":"+OTCHET!K594","v":0},null,"под. § 98-30"]
[null,"ЧИСЛЕНОСТ НА ПЕРСОНАЛА"]
[null,"Щатни бройки "]
[null,"по трудови правоотношения"]
[null,"по служебни правоотношения"]
[]
[null,"Средногодишни щатни бройки "]
[null,"по трудови правоотношения"]
[null,"по служебни правоотношения"]
[null,{"$f":"+IF(+SUM(E$65:I$65)=0,0,\"Контрола: дефицит/излишък = финансиране с обратен знак (V. + VІ. = 0)\")","v":0},null,null,{"$f":"+E$64+E$66","v":0},{"$f":"+F$64+F$66","v":0},{"$f":"+G$64+G$66","v":0},{"$f":"+H$64+H$66","v":0},{"$f":"+I$64+I$66","v":0}]
[]
[null,{"$f":"+OTCHET!H605","v":"odz_narcis@abv.bg"},{"$nulls":4},{"$f":"+OTCHET!E605","v":"086 82 38 91"},{"$f":"+OTCHET!F605","v":0}]
[null,"(e-mail)",{"$nulls":4},"(служебни телефони) "]
[null,"ИЗГОТВИЛ:"]
[{"$nulls":4},{"$f":"+OTCHET!D603","v":"Ел. Николова"}]
[]
[]
[null,"ГЛ. СЧЕТОВОДИТЕЛ:",{"$nulls":5},"РЪКОВОДИТЕЛ:"]
[{"$nulls":4},{"$f":"+OTCHET!G600","v":"Ел. Николова"},{"$nulls":3},{"$f":"+OTCHET!G603","v":"Пепа Добрева"}]

{"sheet":"OTCHET","index":2,"n_rows":1327,"n_cols":14,"rows_kept":1327,"merged":[[6,1,6,3],[8,1,8,3],[8,8,8,9],[9,8,11,9],[11,1,11,3],[18,4,18,7],[18,8,18,11],[21,2,21,3],[27,2,27,3],[32,2,32,3],[38,2,38,3],[173,1,173,3],[175,1,175,3],[178,1,178,3],[182,4,182,7],[182,8,182,11],[186,2,186,3],[189,2,189,3],[195,2,195,3],[203,2,203,3],[204,2,204,3],[222,2,222,3],[226,2,226,3],[232,2,232,3],[235,2,235,3],[236,2,236,3],[237,2,237,3],[238,2,238,3],[239,2,239,3],[254,2,254,3],[255,2,255,3],[256,2,256,3],[257,2,257,3],[264,2,264,3],[268,2,268,3],[269,2,269,3],[270,2,270,3],[271,2,271,3],[274,2,274,3],[275,2,275,3],[283,2,283,3],[286,2,286,3],[287,2,287,3],[292,2,292,3],[296,2,296,3],[305,1,305,3],[307,1,307,3],[310,1,310,3],[343,1,343,3],[347,1,347,3],[349,1,349,3],[352,1,352,3],[356,4,356,7],[360,2,360,3],[374,2,374,3],[382,2,382,3],[387,2,387,3],[390,2,390,3],[395,2,395,3],[398,2,398,3],[401,2,401,3],[404,2,404,3],[405,2,405,3],[408,2,408,3],[411,2,411,3],[421,2,421,3],[422,2,422,3],[423,2,423,3],[424,2,424,3],[425,2,425,3],[432,1,432,3],[434,1,434,3],[437,1,437,3],[441,4,441,7],[448,1,448,3],[450,1,450,3],[453,1,453,3],[457,4,457,7],[460,2,460,3],[464,2,464,3],[467,2,467,3],[470,2,470,3],[477,2,477,3],[480,2,480,3],[496,2,496,3],[501,2,501,3],[502,2,502,3],[511,2,511,3],[515,2,515,3],[520,2,520,3],[523,2,523,3],[530,2,530,3],[534,2,534,3],[535,2,535,3],[540,2,540,3],[543,2,543,3],[565,2,565,3],[585,2,585,3],[590,2,590,3],[599,6,599,9],[600,6,600,9],[602,6,602,9],[603,1,603,2],[603,6,603,9],[604,1,604,2],[604,7,604,9],[606,7,606,9],[612,1,612,3],[614,1,614,3],[617,1,617,3],[621,4,621,7],[621,8,621,11],[628,2,628,3],[631,2,631,3],[637,2,637,3],[645,2,645,3],[646,2,646,3],[664,2,664,3],[668,2,668,3],[674,2,674,3],[677,2,677,3],[678,2,678,3],[679,2,679,3],[680,2,680,3],[681,2,681,3],[696,2,696,3],[697,2,697,3],[698,2,698,3],[699,2,699,3],[706,2,706,3],[710,2,710,3],[711,2,711,3],[712,2,712,3],[713,2,713,3],[716,2,716,3],[717,2,717,3],[725,2,725,3],[728,2,728,3],[729,2,729,3],[734,2,734,3],[738,2,738,3],[739,2,739,3],[749,1,749,3],[751,1,751,3],[754,1,754,3],[758,4,758,7],[758,8,758,11],[765,2,765,3],[768,2,768,3],[774,2,774,3],[782,2,782,3],[783,2,783,3],[801,2,801,3],[805,2,805,3],[811,2,811,3],[814,2,814,3],[815,2,815,3],[816,2,816,3],[817,2,817,3],[818,2,818,3],[833,2,833,3],[834,2,834,3],[835,2,835,3],[836,2,836,3],[843,2,843,3],[847,2,847,3],[848,2,848,3],[849,2,849,3],[850,2,850,3],[853,2,853,3],[854,2,854,3],[862,2,862,3],[865,2,865,3],[866,2,866,3],[871,2,871,3],[875,2,875,3],[876,2,876,3],[886,1,886,3],[888,1,888,3],[891,1,891,3],[895,4,895,7],[895,8,895,11],[902,2,902,3],[905,2,905,3],[911,2,911,3],[919,2,919,3],[920,2,920,3],[938,2,938,3],[942,2,942,3],[948,2,948,3],[951,2,951,3],[952,2,952,3],[953,2,953,3],[954,2,954,3],[955,2,955,3],[970,2,970,3],[971,2,971,3],[972,2,972,3],[973,2,973,3],[980,2,980,3],[984,2,984,3],[985,2,985,3],[986,2,986,3],[987,2,987,3],[990,2,990,3],[991,2,991,3],[999,2,999,3],[1002,2,1002,3],[1003,2,1003,3],[1008,2,1008,3],[1012,2,1012,3],[1013,2,1013,3],[1023,1,1023,3],[1025,1,1025,3],[1028,1,1028,3],[1032,4,1032,7],[1032,8,1032,11],[1039,2,1039,3],[1042,2,1042,3],[1048,2,1048,3],[1056,2,1056,3],[1057,2,1057,3],[1075,2,1075,3],[1079,2,1079,3],[1085,2,1085,3],[1088,2,1088,3],[1089,2,1089,3],[1090,2,1090,3],[1091,2,1091,3],[1092,2,1092,3],[1107,2,1107,3],[1108,2,1108,3],[1109,2,1109,3],[1110,2,1110,3],[1117,2,1117,3],[1121,2,1121,3],[1122,2,1122,3],[1123,2,1123,3],[1124,2,1124,3],[1127,2,1127,3],[1128,2,1128,3],[1136,2,1136,3],[1139,2,1139,3],[1140,2,1140,3],[1145,2,1145,3],[1149,2,1149,3],[1150,2,1150,3],[1160,1,1160,3],[1162,1,1162,3],[1165,1,1165,3],[1169,4,1169,7],[1169,8,1169,11],[1176,2,1176,3],[1179,2,1179,3],[1185,2,1185,3],[1193,2,1193,3],[1194,2,1194,3],[1212,2,1212,3],[1216,2,1216,3],[1222,2,1222,3],[1225,2,1225,3],[1226,2,1226,3],[1227,2,1227,3],[1228,2,1228,3],[1229,2,1229,3],[1244,2,1244,3],[1245,2,1245,3],[1246,2,1246,3],[1247,2,1247,3],[1254,2,1254,3],[1258,2,1258,3],[1259,2,1259,3],[1260,2,1260,3],[1261,2,1261,3],[1264,2,1264,3],[1265,2,1265,3],[1273,2,1273,3],[1276,2,1276,3],[1277,2,1277,3],[1282,2,1282,3],[1286,2,1286,3],[1287,2,1287,3]]}
["a","b","c","d","e","f","f","f","f","f","f","f","endprint"]
[2,{"$nulls":11},1]
[null,"година",2020,{"$nulls":9},1]
[{"$nulls":12},1]
[{"$nulls":4}," "," "," "," "," "," "," "," ",1]
[{"$nulls":5}," "," "," "," "," "," "," ",1]
[null,{"$f":"VLOOKUP(E15,SMETKA,2,FALSE)","v":"ОТЧЕТНИ ДАННИ ПО ЕБК ЗА СМЕТКИТЕ ЗА СРЕДСТВАТА ОТ ЕВРОПЕЙСКИЯ СЪЮЗ - КСФ"},{"$nulls":10},1]
[{"$nulls":4},"за периода от ","до",{"$nulls":6},1]
[null,"ДЕТСКА ГРАДИНА \"НАРЦИС\"",null,null,"2020-01-01","2020-06-30",{"$nulls":6},1]
[null,"(наименование на разпоредителя с бюджет)",{"$nulls":3},{"$f":"VLOOKUP(F9,DateName,2,FALSE)","v":"юни"},null,null,"код от регистъра на бюджетните организации в СЕБРА",{"$nulls":3},1]
[{"$nulls":12},1]
[null,{"$f":"VLOOKUP(F12,PRBK,2,FALSE)","v":"Силистра"},null,null,"код по ЕБК:","6905",{"$nulls":6},1]
[null,"(наименование на първостепенния разпоредител с бюджет)",{"$nulls":4}," ",{"$nulls":3}," "," ",1]
[{"$nulls":12},1]
[{"$nulls":3},"ФИНАНСОВО-ПРАВНА ФОРМА",98,{"$f":"+IF(+E15=0,\"БЮДЖЕТ\",+IF(+E15=98,\"СЕС - КСФ\",+IF(+E15=42,\"СЕС - РА\",+IF(+E15=96,\"СЕС - ДЕС\",+IF(+E15=97,\"СЕС - ДМП\",+IF(+E15=33,\"Чужди средства\"))))))","v":"СЕС - КСФ"},{"$nulls":6},1]
[null,"Бланка версия 1.01 от 2020г.",{"$nulls":10},1]
[{"$nulls":12},1]
[{"$nulls":11},"(в лева)",1]
[{"$nulls":3},"I. П Р И Х О Д И,  П О М О Щ И   И   Д А Р Е Н И Я","Уточнен план 2020 - ПРИХОДИ",{"$nulls":3},"Отчет 2020 - ПРИХОДИ",{"$nulls":3},1]
[null,"§§","под-§§","Н А И М Е Н О В А Н И Е","Уточнен план                Общо","държавни дейности","местни дейности","дофинансиране","държавни дейности -ОТЧЕТ","местни дейности - ОТЧЕТ","дофинансиране - ОТЧЕТ","ОТЧЕТ                                    ОБЩО",1]
[{"$nulls":3}," 0 1 ¦","(1)","(2)","(3)","(4)","(5)","(6)","(7)","(8)",1]
[5,{"v":100,"d":"01-00"},"Данък върху доходите на физически лица:",null,{"$f":"SUM(E23:E25,E26:E27)","v":0},0,0,0,0,0,0,0,{"$f":"(IF($E22<>0,$M$2,IF($L22<>0,$M$2,\"\")))","v":""}]
[10,null,{"v":101,"d":"01-01"},"от доходи по трудови, служебни и приравнени на тях правоотношения",{"$f":"F23+G23+H23","v":0},0,0,0,0,0,0,{"$f":"I23+J23+K23","v":0},{"$f":"(IF($E23<>0,$M$2,IF($L23<>0,$M$2,\"\")))","v":""}]
[15,null,{"v":102,"d":"01-02"},"от еднолични търговци, свободни професии, извънтрудови правоотношения и др.",{"$f":"F24+G24+H24","v":0},0,0,0,0,0,0,{"$f":"I24+J24+K24","v":0},""]
[20,null,{"v":103,"d":"01-03"},"окончателен годишен (патентен) данък и данък върху таксиметров превоз на пътници",{"$f":"F25+G25+H25","v":0},0,null,0,0,null,0,{"$f":"I25+J25+K25","v":0},""]
[20,null,{"v":108,"d":"01-08"},"окончателен данък върху приходите от лихви по банкови сметки на физическите лица",{"$f":"F26+G26+H26","v":0},0,0,0,0,0,0,{"$f":"I26+J26+K26","v":0},""]
[21,null,{"v":109,"d":"01-09"},"окончателен данък  на местни и чуждестранни физически лица по чл. 37 и 38 от ЗДДФЛ",{"$f":"F27+G27+H27","v":0},0,0,0,0,0,0,{"$f":"I27+J27+K27","v":0},""]
[25,{"v":200,"d":"02-00"},"Корпоративен данък:",null,{"$f":"SUM(E29:E32)","v":0},0,0,{"$f":"SUM(H29:H32)","v":0},0,0,{"$f":"SUM(K29:K32)","v":0},0,""]
[30,null,{"v":201,"d":"02-01"},"корпоративен данък от нефинансови предприятия",{"$f":"F29+G29+H29","v":0},0,0,0,0,0,0,{"$f":"I29+J29+K29","v":0},""]
[35,null,{"v":202,"d":"02-02"},"корпоративен данък от финансови институции",0,0,0,0,0,0,0,{"$f":"I30+J30+K30","v":0},""]
[40,null,{"v":203,"d":"02-03"},"корпоративен данък от юридически лица с нестопанска цел",0,0,0,0,0,0,0,{"$f":"I31+J31+K31","v":0},""]
[45,null,{"v":204,"d":"02-04"},"корпоративен данък от застрахователни дружества",0,0,0,0,0,0,0,{"$f":"I32+J32+K32","v":0},""]
[50,{"v":400,"d":"04-00"},"Данъци върху дивидентите, ликвидационните дялове и доходите на местни и чуждестранни лица:",null,{"$f":"SUM(E34:E38)","v":0},0,0,{"$f":"SUM(H34:H38)","v":0},0,0,{"$f":"SUM(K34:K38)","v":0},0,""]
[55,null,{"v":401,"d":"04-01"},"данък върху дивидентите и ликвидационните дялове на местни юридически лица",0,0,0,0,0,0,0,{"$f":"I34+J34+K34","v":0},""]
[56,null,{"v":402,"d":"04-02"},"данък върху дивидентите и ликвидационните дялове на бюджетни предприятия",0,0,0,0,0,0,0,{"$f":"I35+J35+K35","v":0},""]
[57,null,{"v":403,"d":"04-03"},"данък върху дивидентите и ликвидационните дялове на чуждестрани юридически лица",0,0,0,0,0,0,0,{"$f":"I36+J36+K36","v":0},""]
[58,null,{"v":404,"d":"04-04"},"данък върху доходите на чуждестранни юридически лица",0,0,0,0,0,0,0,{"$f":"I37+J37+K37","v":0},""]
[59,null,{"v":411,"d":"04-11"},"данък върху дивидентите и ликвидационните дялове на физически лица",0,0,0,0,0,0,0,{"$f":"I38+J38+K38","v":0},""]
[65,{"v":800,"d":"08-00"},"Осигурителни вноски",null,{"$f":"SUM(E40:E46)","v":0},0,0,{"$f":"SUM(H40:H46)","v":0},0,0,{"$f":"SUM(K40:K46)","v":0},0,""]
[70,null,{"v":801,"d":"08-01"},"вноски за работници и служители от работодатели",0,0,0,0,0,0,0,{"$f":"I40+J40+K40","v":0},""]
[75,null,{"v":802,"d":"08-02"},"вноски от работници и служители (лична вноска) ",0,0,0,0,0,0,0,0,""]
[80,null,{"v":804,"d":"08-04"},"вноски от самонаети лица (самоосигуряващи се лица) ",0,0,0,0,0,0,0,0,""]
[85,null,{"v":809,"d":"08-09"},"вноски  за други категории осигурени лица",{"$f":"F43+G43+H43","v":0},0,0,0,0,0,0,0,""]
[85,null,{"v":811,"d":"08-11"},"вноски по чл. 4б и 4в от КСО за сметка на осигурителя",{"$f":"F44+G44+H44","v":0},0,0,0,0,0,0,0,""]
[85,null,{"v":812,"d":"08-12"},"вноски по чл. 4б от КСО за сметка на осигурените лица",{"$f":"F45+G45+H45","v":0},0,0,0,0,0,0,0,""]
[85,null,{"v":814,"d":"08-14"},"вноски по чл. 4б от КСО от самонаети лица (самоосигуряващи се лица) ",0,0,0,0,0,0,0,0,""]
[95,{"v":1000,"d":"10-00"},"Здравно-осигурителни вноски",null,{"$f":"SUM(E48:E51)","v":0},0,0,{"$f":"SUM(H48:H51)","v":0},0,0,{"$f":"SUM(K48:K51)","v":0},0,""]
[100,null,{"v":1001,"d":"10-01"},"здравно-осигурителни вноски за работници и служители от работодатели",0,0,0,0,0,0,0,{"$f":"I48+J48+K48","v":0},""]
[105,null,{"v":1002,"d":"10-02"},"здравно-осигурителни вноски от работници и служители (лична вноска) ",0,0,0,0,0,0,0,{"$f":"I49+J49+K49","v":0},""]
[110,null,{"v":1004,"d":"10-04"},"здравно-осигурителни вноски от самонаети (самоосигуряващи се лица) ",0,0,0,0,0,0,0,{"$f":"I50+J50+K50","v":0},""]
[125,null,{"v":1007,"d":"10-07"},"здравно-осигур.вноски  за други категории осигурени лица",0,0,0,0,0,0,0,{"$f":"I51+J51+K51","v":0},""]
[130,{"v":1300,"d":"13-00"},"Имуществени и други местни данъци :",null,{"$f":"SUM(E53:E57)","v":0},0,0,{"$f":"SUM(H53:H57)","v":0},0,0,{"$f":"SUM(K53:K57)","v":0},0,""]
[135,null,{"v":1301,"d":"13-01"},"данък върху недвижими имоти",0,0,null,0,0,null,0,{"$f":"I53+J53+K53","v":0},""]
[140,null,{"v":1302,"d":"13-02"},"данък върху наследствата",0,0,null,0,0,null,0,{"$f":"I54+J54+K54","v":0},""]
[145,null,{"v":1303,"d":"13-03"},"данък върху превозните средства",0,0,null,0,0,null,0,{"$f":"I55+J55+K55","v":0},""]
[null,null,{"v":1304,"d":"13-04"},"данък при придобиване на имущество по дарения и възмезден начин",0,0,null,0,0,null,0,{"$f":"I56+J56+K56","v":0},""]
[150,null,{"v":1308,"d":"13-08"},"туристически данък",0,0,null,0,0,null,0,{"$f":"I57+J57+K57","v":0},""]
[160,{"v":1400,"d":"14-00"},"Данък върху добавената стойност",null,{"$f":"SUM(E59:E60)","v":0},0,0,{"$f":"SUM(H59:H60)","v":0},0,0,{"$f":"SUM(K59:K60)","v":0},0,""]
[165,null,{"v":1401,"d":"14-01"},"данък върху добавената стойност при сделки в страната",0,0,0,0,0,0,0,{"$f":"I59+J59+K59","v":0},""]
[170,null,{"v":1402,"d":"14-02"},"данък върху добавената стойност при внос",0,0,0,0,0,0,0,{"$f":"I60+J60+K60","v":0},""]
[175,{"v":1500,"d":"15-00"},"Акцизи ",null,{"$f":"SUM(E62:E63)","v":0},0,0,{"$f":"SUM(H62:H63)","v":0},0,0,{"$f":"SUM(K62:K63)","v":0},0,""]
[180,null,{"v":1501,"d":"15-01"},"акциз при сделки в страната",0,0,0,0,0,0,0,{"$f":"I62+J62+K62","v":0},""]
[185,null,{"v":1502,"d":"15-02"},"акциз при внос",0,0,0,0,0,0,0,{"$f":"I63+J63+K63","v":0},""]
[null,{"v":1600,"d":"16-00"},"Данък върху застрахователните премии",null,0,0,0,0,0,0,0,{"$f":"I64+J64+K64","v":0},""]
[200,{"v":1700,"d":"17-00"},"Други данъци по Закона за корпоративното подоходно облагане:",null,{"$f":"SUM(E66:E71)","v":0},0,0,{"$f":"SUM(H66:H71)","v":0},0,0,{"$f":"SUM(K66:K71)","v":0},0,""]
[205,null,{"v":1701,"d":"17-01"},"данък върху представителните разходи",0,0,0,0,0,0,0,{"$f":"I66+J66+K66","v":0},""]
[210,null,{"v":1702,"d":"17-02"},"данък върху разходи, предоставяни в натура",0,0,0,0,0,0,0,0,""]
[215,null,{"v":1703,"d":"17-03"},"данък върху разходите за превозни средства",0,0,0,0,0,0,0,0,""]
[225,null,{"v":1706,"d":"17-06"},"окончателни данъци върху залози за хазартни игри и хазартни съоръжения",0,0,0,0,0,0,0,0,""]
[226,null,{"v":1707,"d":"17-07"},"данък върху дейността от опериране на кораби",0,0,0,0,0,0,0,0,""]
[227,null,{"v":1709,"d":"17-09"},"данък върху приходите на бюджетните предприятия",0,0,0,0,0,0,0,0,""]
[235,{"v":1900,"d":"19-00"},"Мита и митнически такси",null,0,0,0,0,0,0,0,0,""]
[255,{"v":2000,"d":"20-00"},"Други данъци",null,0,0,null,0,0,null,0,0,""]
[265,{"v":2400,"d":"24-00"},"Приходи и доходи от собственост",null,{"$f":"SUM(E75:E89)","v":0},0,0,{"$f":"SUM(H75:H89)","v":0},0,0,{"$f":"SUM(K75:K89)","v":0},0,""]
[270,null,{"v":2401,"d":"24-01"},"вноски от приходи на държавни (общински) предприятия и институции",0,0,null,0,0,null,0,{"$f":"I75+J75+K75","v":0},""]
[280,null,{"v":2403,"d":"24-03"},"превишение на приходите над разходите на БНБ",0,0,0,0,0,0,0,{"$f":"I76+J76+K76","v":0},""]
[285,null,{"v":2404,"d":"24-04"},"нетни приходи от продажби на услуги, стоки и продукция",0,null,null,0,null,null,0,0,""]
[290,null,{"v":2405,"d":"24-05"},"приходи от наеми на имущество",0,null,null,0,null,null,0,0,""]
[295,null,{"v":2406,"d":"24-06"},"приходи от наеми на земя",0,null,null,0,null,null,0,0,""]
[300,null,{"v":2407,"d":"24-07"},"приходи от дивиденти",0,null,null,0,null,null,0,0,""]
[305,null,{"v":2408,"d":"24-08"},"приходи от лихви по текущи банкови сметки",0,null,null,0,null,null,0,0,""]
[310,null,{"v":2409,"d":"24-09"},"приходи от лихви по срочни депозити",0,null,null,0,null,null,0,0,""]
[315,null,{"v":2410,"d":"24-10"},"приходи от лихви по предоставени заеми в страната и чужбина",0,null,null,0,null,null,0,0,""]
[325,null,{"v":2412,"d":"24-12"},"приходи от лихви от предприятия по преоформен държавен дълг",0,0,0,0,0,0,0,0,""]
[330,null,{"v":2413,"d":"24-13"},"приходи от лихви и отстъпки от държавни и общински ценни книжа",0,0,null,0,0,null,0,0,""]
[335,null,{"v":2415,"d":"24-15"},"приходи от лихви и отстъпки от дългови ценни книжа на местни и чуждестранни лица",0,0,null,0,0,null,0,0,""]
[null,null,{"v":2417,"d":"24-17"},"приходи от лихви по заеми, предоставени на бюджетни организации",0,0,null,0,0,null,0,{"$f":"I87+J87+K87","v":0},""]
[340,null,{"v":2418,"d":"24-18"},"лихви по срочни депозити за сметка на централния бюджет (+/-)",0,0,null,0,0,null,0,0,""]
[345,null,{"v":2419,"d":"24-19"},"приходи от други лихви",0,null,null,0,null,null,0,0,""]
[350,{"v":2500,"d":"25-00"},"Държавни такси",null,{"$f":"SUM(E91:E92)","v":0},0,0,{"$f":"SUM(H91:H92)","v":0},0,0,{"$f":"SUM(K91:K92)","v":0},0,{"$f":"(IF($E90<>0,$M$2,IF($L90<>0,$M$2,\"\")))","v":""}]
[355,null,{"v":2501,"d":"25-01"},"такси за административни и други услуги и дейности",0,null,null,0,null,null,0,{"$f":"I91+J91+K91","v":0},""]
[356,null,{"v":2502,"d":"25-02"},"такси и лицензии с данъчен характер",0,null,0,0,null,0,0,{"$f":"I92+J92+K92","v":0},""]
[360,{"v":2600,"d":"26-00"},"Съдебни такси",null,0,0,0,0,0,0,0,{"$f":"I93+J93+K93","v":0},""]
[370,{"v":2700,"d":"27-00"},"Общински такси",null,{"$f":"SUM(E95:E107)","v":0},0,0,{"$f":"SUM(H95:H107)","v":0},0,0,{"$f":"SUM(K95:K107)","v":0},0,""]
[375,null,{"v":2701,"d":"27-01"},"за ползване на детски градини",0,0,null,0,0,null,0,{"$f":"I95+J95+K95","v":0},""]
[380,null,{"v":2702,"d":"27-02"},"за ползване на детски ясли и други по здравеопазването",{"$f":"F96+G96+H96","v":0},0,null,0,0,null,0,0,""]
[385,null,{"v":2703,"d":"27-03"},"за ползване на лагери и други по социалния отдих",0,0,null,0,0,null,0,0,""]
[390,null,{"v":2704,"d":"27-04"},"за ползване на домашен социален патронаж и други общински социални услуги",0,0,null,0,0,null,0,0,""]
[395,null,{"v":2705,"d":"27-05"},"за ползване на пазари, тържища, панаири, тротоари, улични платна и др.",0,0,null,0,0,null,0,0,""]
[400,null,{"v":2706,"d":"27-06"},"за ползване на полудневни детски градини",0,0,null,0,0,null,0,0,""]
[405,null,{"v":2707,"d":"27-07"},"за битови отпадъци",0,0,null,0,0,null,0,0,""]
[410,null,{"v":2708,"d":"27-08"},"за ползване на общежития и други по образованието",0,null,null,0,null,null,0,0,""]
[420,null,{"v":2710,"d":"27-10"},"за технически услуги",0,null,null,0,null,null,0,0,""]
[425,null,{"v":2711,"d":"27-11"},"за административни услуги",0,null,null,0,null,null,0,0,""]
[430,null,{"v":2715,"d":"27-15"},"за откупуване на гробни места",0,0,null,0,0,null,0,0,""]
[436,null,{"v":2717,"d":"27-17"},"за притежаване на куче",0,0,null,0,0,null,0,0,""]
[440,null,{"v":2729,"d":"27-29"},"други общински такси",0,null,null,0,null,null,0,0,""]
[445,{"v":2800,"d":"28-00"},"Глоби, санкции и наказателни лихви",null,{"$f":"+E109+E110+E111","v":0},0,0,{"$f":"+H109+H110+H111","v":0},0,0,{"$f":"+K109+K110+K111","v":0},{"$f":"SUM(L109:L111)","v":0},""]
[450,null,{"v":2801,"d":"28-01"},"конфискувани средства и приходи от продажби на конфискувани и придобити от залог вещи",{"$f":"F109+G109+H109","v":0},null,null,0,null,null,0,{"$f":"I109+J109+K109","v":0},""]
[455,null,{"v":2802,"d":"28-02"},"глоби, санкции, неустойки, наказателни лихви, обезщетения и начети",{"$f":"F110+G110+H110","v":0},null,null,0,null,null,0,{"$f":"I110+J110+K110","v":0},""]
[455,null,{"v":2809,"d":"28-09"},"наказателни лихви за данъци, мита и осигурителни вноски",{"$f":"F111+G111+H111","v":0},null,null,0,null,null,0,{"$f":"I111+J111+K111","v":0},""]
[470,{"v":3600,"d":"36-00"},"Други приходи",null,{"$f":"SUM(E113:E120)","v":0},0,0,{"$f":"SUM(H113:H120)","v":0},0,0,{"$f":"SUM(K113:K120)","v":0},0,""]
[475,null,{"v":3601,"d":"36-01"},"реализирани курсови разлики от валутни операции (нето) (+/-)",{"$f":"F113+G113+H113","v":0},null,null,0,null,null,0,{"$f":"I113+J113+K113","v":0},""]
[null,null,{"v":3605,"d":"36-05"},"прехвърлени/възстановени акумулирани средства от осигурителни вноски",{"$f":"F114+G114+H114","v":0},0,0,0,0,0,0,{"$f":"I114+J114+K114","v":0},""]
[null,null,{"v":3608,"d":"36-08"},"вноски за фонд \"ИЕЯС\" и фонд \"РАО\"",{"$f":"F115+G115+H115","v":0},0,0,0,0,0,0,{"$f":"I115+J115+K115","v":0},""]
[null,null,{"v":3610,"d":"36-10"},"приходи от други вноски",0,null,null,0,null,null,0,0,""]
[480,null,{"v":3611,"d":"36-11"},"получени застрахователни обезщетения за ДМА",0,null,null,0,null,null,0,0,""]
[485,null,{"v":3612,"d":"36-12"},"получени други застрахователни обезщетения",0,null,null,0,null,null,0,0,""]
[null,null,{"v":3618,"d":"36-18"},"коректив за касови постъпления (-/+) ",0,null,null,0,null,null,0,0,""]
[490,null,{"v":3619,"d":"36-19"},"други неданъчни приходи",0,null,null,0,null,null,0,0,""]
[495,{"v":3700,"d":"37-00"},"Внесени ДДС и други данъци върху продажбите ",null,{"$f":"SUM(E122:E124)","v":0},0,0,{"$f":"SUM(H122:H124)","v":0},0,0,{"$f":"SUM(K122:K124)","v":0},0,""]
[500,null,{"v":3701,"d":"37-01"},"внесен ДДС (-)",{"$f":"F122+G122+H122","v":0},null,null,0,null,null,0,{"$f":"I122+J122+K122","v":0},""]
[505,null,{"v":3702,"d":"37-02"},"внесен данък върху приходите от стопанска дейност на бюджетните предприятия (-)",{"$f":"F123+G123+H123","v":0},null,null,0,null,null,0,{"$f":"I123+J123+K123","v":0},""]
[510,null,{"v":3709,"d":"37-09"},"внесени други данъци,такси и вноски върху продажбите (-)",{"$f":"F124+G124+H124","v":0},null,null,0,null,null,0,{"$f":"I124+J124+K124","v":0},""]
[515,{"v":4000,"d":"40-00"},"Постъпления от продажба на нефинансови активи (без § 40-71)",null,{"$f":"SUM(E126:E136)","v":0},0,0,{"$f":"SUM(H126:H136)","v":0},0,0,{"$f":"SUM(K126:K136)","v":0},0,""]
[516,null,{"v":4021,"d":"40-21"},"постъпления от продажба на компютри и хардуер",{"$f":"F126+G126+H126","v":0},null,null,0,null,null,0,{"$f":"I126+J126+K126","v":0},""]
[517,null,{"v":4022,"d":"40-22"},"постъпления от продажба на сгради",0,null,null,0,null,null,0,0,""]
[518,null,{"v":4023,"d":"40-23"},"постъпления от продажба на друго оборудване, машини и съоръжения",0,null,null,0,null,null,0,0,""]
[519,null,{"v":4024,"d":"40-24"},"постъпления от продажба на транспортни средства",0,null,null,0,null,null,0,0,""]
[520,null,{"v":4025,"d":"40-25"},"постъпления от продажба на стопански инвентар",0,null,null,0,null,null,0,0,""]
[521,null,{"v":4026,"d":"40-26"},"постъпления от продажба на инфраструктурни обекти",0,null,null,0,null,null,0,0,""]
[522,null,{"v":4029,"d":"40-29"},"постъпления от продажба на други ДМА",0,null,null,0,null,null,0,0,""]
[523,null,{"v":4030,"d":"40-30"},"постъпления от продажба на нематериални дълготрайни активи",0,null,null,0,null,null,0,0,""]
[523,null,{"v":4039,"d":"40-39"},"постъпления от продажба на квоти за емисии на парникови газове",0,null,null,0,null,null,0,0,""]
[524,null,{"v":4040,"d":"40-40"},"постъпления от продажба на земя",0,null,null,0,null,null,0,0,""]
[526,null,{"v":4072,"d":"40-72"},"постъпления от продажба на земеделска продукция",0,null,null,0,null,null,0,0,""]
[540,{"v":4100,"d":"41-00"},"Приходи от концесии",null,0,0,null,0,0,null,0,0,""]
[550,{"v":4200,"d":"42-00"},"Приходи от лицензии за ползване на държавни/общински активи",null,0,0,0,0,0,0,0,0,""]
[560,{"v":4500,"d":"45-00"},"Помощи и дарения от страната",null,{"$f":"SUM(E140:E141)","v":0},0,0,{"$f":"SUM(H140:H141)","v":0},0,0,{"$f":"SUM(K140:K141)","v":0},0,""]
[565,null,{"v":4501,"d":"45-01"},"текущи помощи и дарения от страната",{"$f":"F140+G140+H140","v":0},null,null,0,null,null,0,{"$f":"I140+J140+K140","v":0},""]
[570,null,{"v":4503,"d":"45-03"},"капиталови помощи и дарения от страната",{"$f":"F141+G141+H141","v":0},null,null,0,null,null,0,{"$f":"I141+J141+K141","v":0},""]
[575,{"v":4600,"d":"46-00"},"Помощи и дарения от чужбина",null,{"$f":"SUM(E143:E150)","v":0},0,0,{"$f":"SUM(H143:H150)","v":0},0,0,{"$f":"SUM(K143:K150)","v":0},0,""]
[580,null,{"v":4610,"d":"46-10"},"текущи помощи и дарения от Европейския съюз",{"$f":"F143+G143+H143","v":0},null,null,0,null,null,0,{"$f":"I143+J143+K143","v":0},""]
[585,null,{"v":4620,"d":"46-20"},"капиталови помощи и дарения от Европейския съюз",0,null,null,0,null,null,0,0,""]
[590,null,{"v":4630,"d":"46-30"},"текущи помощи и дарения от други държави",0,null,null,0,null,null,0,0,""]
[595,null,{"v":4640,"d":"46-40"},"капиталови помощи и дарения от други държави",0,null,null,0,null,null,0,0,""]
[600,null,{"v":4650,"d":"46-50"},"текущи помощи и дарения от други международни организации",0,null,null,0,null,null,0,0,""]
[605,null,{"v":4660,"d":"46-60"},"капиталови помощи и дарения от други международни организации",0,null,null,0,null,null,0,0,""]
[610,null,{"v":4670,"d":"46-70"},"други текущи помощи и дарения от чужбина",0,null,null,0,null,null,0,0,""]
[615,null,{"v":4680,"d":"46-80"},"други капиталови помощи и дарения  от чужбина",0,null,null,0,null,null,0,0,""]
[575,{"v":4700,"d":"47-00"},"Получени чрез небюджетни предприятия средства от КФП по международни и други програми",null,{"$f":"SUM(E152:E159)","v":0},0,0,{"$f":"SUM(H152:H159)","v":0},0,0,{"$f":"SUM(K152:K159)","v":0},0,""]
[580,null,{"v":4743,"d":"47-43"},"получени чрез нефинансови предприятия текущи трансфери от КФП по международни и други  програми ",{"$f":"F152+G152+H152","v":0},null,null,0,null,null,0,{"$f":"I152+J152+K152","v":0},""]
[585,null,{"v":4744,"d":"47-44"},"получени чрез финансови институции текущи трансфери от КФП по международни и други  програми",0,null,null,0,null,null,0,0,""]
[590,null,{"v":4745,"d":"47-45"},"получени чрез нестопански организации текущи трансфери от КФП по международни и други  програми ",0,null,null,0,null,null,0,0,""]
[595,null,{"v":4749,"d":"47-49"},"получени чрез предприятия от чужбина текущи трансфери от КФП по международни и други  програми",0,null,null,0,null,null,0,0,""]
[600,null,{"v":4751,"d":"47-51"},"получени чрез нефинансови предприятия капиталови трансфери от КФП по международни и други  програми ",0,null,null,0,null,null,0,0,""]
[605,null,{"v":4752,"d":"47-52"},"получени чрез финансови институции капиталови трансфери от КФП по международни и други  програми ",0,null,null,0,null,null,0,0,{"$f":"(IF($E157<>0,$M$2,IF($L157<>0,$M$2,\"\")))","v":""}]
[610,null,{"v":4753,"d":"47-53"},"получени чрез нестопански организации капиталови трансфери от КФП по международни и други  програми",0,null,null,0,null,null,0,0,""]
[615,null,{"v":4759,"d":"47-59"},"получени чрез предприятия от чужбина капиталови трансфери от КФП по международни и други  програми",0,null,null,0,null,null,0,0,""]
[575,{"v":4800,"d":"48-00"},"Разпределени към администратори от чужбина средства по международни програми и договори (-)",null,{"$f":"SUM(E161:E168)","v":0},0,0,{"$f":"SUM(H161:H168)","v":0},0,0,{"$f":"SUM(K161:K168)","v":0},0,""]
[580,null,{"v":4810,"d":"48-10"},"разпределени към чужбина текущи трансфери по програми на Европейския съюз (-)",{"$f":"F161+G161+H161","v":0},null,null,0,null,null,0,{"$f":"I161+J161+K161","v":0},""]
[585,null,{"v":4820,"d":"48-20"},"разпределени към чужбина капиталови трансфери по програми на Европейския съюз ",0,null,null,0,null,null,0,0,""]
[590,null,{"v":4830,"d":"48-30"},"разпределени към чужбина текущи трансфери по програми на други държави (-)",0,null,null,0,null,null,0,0,""]
[595,null,{"v":4840,"d":"48-40"},"разпределени към чужбина капиталови трансфери по програми на други държави (-)",0,null,null,0,null,null,0,0,""]
[600,null,{"v":4850,"d":"48-50"},"разпределени към чужбина текущи трансфери по програми на други международни организации (-)",0,null,null,0,null,null,0,0,""]
[605,null,{"v":4860,"d":"48-60"},"разпределени към чужбина капиталови трансфери по програми на други международни организации  (-)",0,null,null,0,null,null,0,0,""]
[610,null,{"v":4870,"d":"48-70"},"разпределени към чужбина текущи трансфери по други чуждестранни дарения и помощи (-)",0,null,null,0,null,null,0,0,""]
[615,null,{"v":4880,"d":"48-80"},"разпределени към чужбина капиталови трансфери по други чуждестранни дарения и помощи (-)",0,null,null,0,null,null,0,0,""]
[620,"ВСИЧКО","99-99","I. В С И Ч К О   П Р И Х О Д И,  П О М О Щ И   И   Д А Р Е Н И Я",{"$f":"SUM(E22,E28,E33,E39,E47,E52,E58,E61,E64,E65,E72,E73,E74,E90,E93,E94,E108,E112,E121,E125,E137,E138,E139,E142,E151,E160)","v":0},0,0,0,0,0,0,0,1]
[{"v":113,"d":"01-13"},null,null,"      в т.ч. данък върху таксиметров превоз на пътници",0,0,null,0,0,null,0,0,1]
[{"$nulls":12},1]
[{"$nulls":12},1]
[{"$nulls":12},1]
[null,{"$f":"$B$7","v":"ОТЧЕТНИ ДАННИ ПО ЕБК ЗА СМЕТКИТЕ ЗА СРЕДСТВАТА ОТ ЕВРОПЕЙСКИЯ СЪЮЗ - КСФ"},{"$nulls":10},1]
[{"$nulls":4},"за периода от ","до",{"$nulls":6},1]
[null,{"$f":"$B$9","v":"ДЕТСКА ГРАДИНА \"НАРЦИС\""},null,null,{"$f":"$E$9","v":"2020-01-01"},{"$f":"$F$9","v":"2020-06-30"},{"$nulls":6},1]
[null,{"$f":"$B$10","v":"(наименование на разпоредителя с бюджет)"},{"$nulls":10},1]
[{"$nulls":12},1]
[null,{"$f":"$B$12","v":"Силистра"},null,null,"       код по ЕБК:",{"$f":"$F$12","v":"6905"},{"$nulls":6},1]
[null,{"$f":"$B$13","v":"(наименование на първостепенния разпоредител с бюджет)"},{"$nulls":10},1]
[{"$nulls":3},"ФИНАНСОВО-ПРАВНА ФОРМА",{"$f":"$E$15","v":98},{"$f":"$F$15","v":"СЕС - КСФ"},{"$nulls":6},1]
[{"$nulls":7},"(в лева)",{"$nulls":3},"(в лева)",1]
[{"$nulls":3},"II. РАЗХОДИ - РЕКАПИТУЛАЦИЯ ПО ПАРАГРАФИ И ПОДПАРАГРАФИ","Уточнен план 2020 - РАЗХОДИ - рекапитулация",{"$nulls":3},"Отчет 2020 - РАЗХОДИ - рекапитулация",{"$nulls":3},1]
[null,"§§","под-§§","НАИМЕНОВАНИЕ НА ПАРАГРАФИТЕ И ПОДПАРАГРАФИТЕ",{"$f":"E20","v":"Уточнен план                Общо"},"държавни дейности","местни дейности","дофинансиране","държавни дейности -ОТЧЕТ","местни дейности - ОТЧЕТ","дофинансиране - ОТЧЕТ","ОТЧЕТ                                    ОБЩО",1]
[{"$nulls":3}," 02 ¦","(1)","(2)","(3)","(4)","(5)","(6)","(7)","(8)",1]
[{"$nulls":12},1]
[5,{"v":100,"d":"01-00"},"Заплати и възнаграждения за персонала, нает по трудови и служебни правоотношения",null,{"$f":"SUMIF($B$607:$B$12313,$B187,E$607:E$12313)","v":{"v":12491,"d":"12,491"}},{"v":12491,"d":"12,491"},0,0,{"v":12491,"d":"12,491"},0,0,{"v":12491,"d":"12,491"},{"$f":"(IF($E187<>0,$M$2,IF($L187<>0,$M$2,\"\")))","v":1}]
[10,null,{"v":101,"d":"01-01"},"заплати и възнаграждения на персонала нает по трудови правоотношения",{"$f":"SUMIF($C$607:$C$12313,$C188,E$607:E$12313)","v":{"v":12491,"d":"12,491"}},{"v":12491,"d":"12,491"},0,0,{"v":12491,"d":"12,491"},0,0,{"v":12491,"d":"12,491"},1]
[15,null,{"v":102,"d":"01-02"},"заплати и възнаграждения на персонала нает по служебни правоотношения",0,0,0,0,0,0,0,0,""]
[35,{"v":200,"d":"02-00"},"Други възнаграждения и плащания за персонала",null,{"$f":"SUMIF($B$607:$B$12313,$B190,E$607:E$12313)","v":683},683,0,0,683,0,0,683,1]
[40,null,{"v":201,"d":"02-01"},"за нещатен персонал нает по трудови правоотношения ",{"$f":"SUMIF($C$607:$C$12313,$C191,E$607:E$12313)","v":0},0,0,0,0,0,0,0,""]
[45,null,{"v":202,"d":"02-02"},"за персонала по извънтрудови правоотношения",0,0,0,0,0,0,0,0,""]
[50,null,{"v":205,"d":"02-05"},"изплатени суми от СБКО за облекло и други на персонала, с характер на възнаграждение",430,430,0,0,430,0,0,430,1]
[55,null,{"v":208,"d":"02-08"},"обезщетения за персонала, с характер на възнаграждение",0,0,0,0,0,0,0,0,""]
[60,null,{"v":209,"d":"02-09"},"другиплащания и възнаграждения",253,253,0,0,253,0,0,253,1]
[65,{"v":500,"d":"05-00"},"Задължителни осигурителни вноски от работодатели",null,{"$f":"SUMIF($B$607:$B$12313,$B196,E$607:E$12313)","v":{"v":2567,"d":"2,567"}},{"v":2567,"d":"2,567"},0,0,{"v":2567,"d":"2,567"},0,0,{"v":2567,"d":"2,567"},1]
[70,null,{"v":551,"d":"05-51"},"осигурителни вноски от работодатели за Държавното обществено осигуряване (ДОО)",{"$f":"SUMIF($C$607:$C$12313,$C197,E$607:E$12313)","v":{"v":1292,"d":"1,292"}},{"v":1292,"d":"1,292"},0,0,{"v":1292,"d":"1,292"},0,0,{"v":1292,"d":"1,292"},1]
[75,null,{"v":552,"d":"05-52"},"осигурителни вноски от работодатели за Учителския пенсионен фонд (УчПФ)",380,380,0,0,380,0,0,380,1]
[80,null,{"v":558,"d":"05-58"},"вноски по чл. 4б и 4в от КСО за сметка на осигурителя",0,0,0,0,0,0,0,0,""]
[80,null,{"v":560,"d":"05-60"},"здравно-осигурителни вноски от работодатели",600,600,0,0,600,0,0,600,1]
[85,null,{"v":580,"d":"05-80"},"вноски за допълнително задължително осигуряване от работодатели",295,295,0,0,295,0,0,295,1]
[90,null,{"v":588,"d":"05-88"},"коректив на вноски за ДЗПО за сумите по чл. 4б и 4в от КСО за сметка на осигурителя",0,0,0,0,0,0,0,0,""]
[90,null,{"v":590,"d":"05-90"},"задължителни вноски за чуждестранни пенсионни фондове и  схеми за сметка на осигурителя",0,0,0,0,0,0,0,0,""]
[115,{"v":800,"d":"08-00"},"Вноски за доброволно осигуряване  ",null,{"$f":"SUMIF($B$607:$B$12313,$B204,E$607:E$12313)","v":0},0,0,0,0,0,0,0,""]
[125,{"v":1000,"d":"10-00"},"Издръжка",null,483,483,0,0,483,0,0,483,1]
[130,null,{"v":1011,"d":"10-11"},"Храна",{"$f":"SUMIF($C$607:$C$12313,$C206,E$607:E$12313)","v":0},0,0,0,0,0,0,0,""]
[135,null,{"v":1012,"d":"10-12"},"Медикаменти",0,0,0,0,0,0,0,0,""]
[140,null,{"v":1013,"d":"10-13"},"Постелен инвентар и облекло",380,380,0,0,380,0,0,380,1]
[145,null,{"v":1014,"d":"10-14"},"Учебни и научно-изследователски разходи и книги за библиотеките",0,0,0,0,0,0,0,0,""]
[150,null,{"v":1015,"d":"10-15"},"материали",103,103,0,0,103,0,0,103,1]
[155,null,{"v":1016,"d":"10-16"},"вода, горива и енергия",0,0,0,0,0,0,0,0,""]
[160,null,{"v":1020,"d":"10-20"},"разходи за външни услуги",0,0,0,0,0,0,0,0,""]
[165,null,{"v":1030,"d":"10-30"},"Текущ ремонт",0,0,0,0,0,0,0,0,""]
[175,null,{"v":1051,"d":"10-51"},"командировки в страната",0,0,0,0,0,0,0,0,""]
[180,null,{"v":1052,"d":"10-52"},"краткосрочни командировки в чужбина",0,0,0,0,0,0,0,0,""]
[185,null,{"v":1053,"d":"10-53"},"дългосрочни командировки в чужбина",{"$f":"SUMIF($C$607:$C$12313,$C216,E$607:E$12313)","v":0},0,0,0,0,0,0,0,""]
[190,null,{"v":1062,"d":"10-62"},"разходи за застраховки",0,0,0,0,0,0,0,0,""]
[200,null,{"v":1063,"d":"10-63"},"такса ангажимент по заеми",0,0,0,0,0,0,0,0,""]
[200,null,{"v":1069,"d":"10-69"},"други финансови услуги",0,0,0,0,0,0,0,0,""]
[205,null,{"v":1091,"d":"10-91"},"други разходи за СБКО",0,0,0,0,0,0,0,0,""]
[210,null,{"v":1092,"d":"10-92"},"разходи за договорни санкции и неустойки, съдебни обезщетения и разноски",0,0,0,0,0,0,0,0,""]
[215,null,{"v":1098,"d":"10-98"},"други разходи, некласифицирани в другите параграфи и подпараграфи",0,0,0,0,0,0,0,0,""]
[220,{"v":1900,"d":"19-00"},"Платени данъци, такси и административни санкции",null,{"$f":"SUMIF($B$607:$B$12313,$B223,E$607:E$12313)","v":0},0,0,0,0,0,0,0,""]
[225,null,{"v":1901,"d":"19-01"},"платени държавни данъци, такси, наказателни лихви и административни санкции",{"$f":"SUMIF($C$607:$C$12313,$C224,E$607:E$12313)","v":0},0,0,0,0,0,0,0,""]
[230,null,{"v":1981,"d":"19-81"},"платени общински данъци, такси, наказателни лихви и административни санкции",0,0,0,0,0,0,0,0,""]
[245,null,{"v":1991,"d":"19-91"},"платени данъци, такси, наказателни лихви и административни санкции в чужбина",0,0,0,0,0,0,0,0,""]
[220,{"v":2100,"d":"21-00"},"Разходи за лихви по емисии на държавни (общински) ценни книжа",null,{"$f":"SUMIF($B$607:$B$12313,$B227,E$607:E$12313)","v":0},0,0,0,0,0,0,0,""]
[225,null,{"v":2110,"d":"21-10"},"лихви по държавни (общински) ценни книжа",{"$f":"SUMIF($C$607:$C$12313,$C228,E$607:E$12313)","v":0},0,0,0,0,0,0,0,""]
[230,null,{"v":2120,"d":"21-20"},"отстъпки по държавни (общински) ценни книжа",0,0,0,0,0,0,0,0,""]
[235,null,{"v":2125,"d":"21-25"},"лихви и отстъпки по целеви емисии на държавни ценни книжа",0,0,0,0,0,0,0,0,""]
[240,null,{"v":2140,"d":"21-40"},"лихви по държавни ценни книжа, емитирани за структурната реформа ",0,0,0,0,0,0,0,0,""]
[245,null,{"v":2190,"d":"21-90"},"премии над номинала от емисии на държавни (общински) ценни книжа (-)",0,0,0,0,0,0,0,0,""]
[250,{"v":2200,"d":"22-00"},"Разходи за лихви по заеми от страната",null,{"$f":"SUMIF($B$607:$B$12313,$B233,E$607:E$12313)","v":0},0,0,0,0,0,0,0,""]
[255,null,{"v":2221,"d":"22-21"},"Разходи за лихви по заеми от банки в страната",{"$f":"SUMIF($C$607:$C$12313,$C234,E$607:E$12313)","v":0},0,0,0,0,0,0,0,""]
[265,null,{"v":2224,"d":"22-24"},"Разходи за лихви по други заеми от страната",0,0,0,0,0,0,0,0,""]
[270,{"v":2500,"d":"25-00"},"Разходи за лихви по заеми от други държави",null,{"$f":"SUMIF($B$607:$B$12313,$B236,E$607:E$12313)","v":0},0,0,0,0,0,0,0,""]
[290,{"v":2600,"d":"26-00"},"Разходи за лихви по заеми от международни организации и институции",null,0,0,0,0,0,0,0,0,""]
[320,{"v":2700,"d":"27-00"},"Разходи за лихви по заеми от банки и други финансови институции от чужбина",null,0,0,0,0,0,0,0,0,""]
[330,{"v":2800,"d":"28-00"},"Разходи за лихви и отстъпки по облигации емитирани и търгувани на международните капиталови пазари",null,0,0,0,0,0,0,0,0,""]
[350,{"v":2900,"d":"29-00"},"Други разходи за лихви",null,0,0,0,0,0,0,0,0,""]
[355,null,{"v":2910,"d":"29-10"},"Платени лихви по финансов лизинг и търговски кредит",{"$f":"SUMIF($C$607:$C$12313,$C241,E$607:E$12313)","v":0},0,0,0,0,0,0,0,""]
[355,null,{"v":2920,"d":"29-20"},"Платени лихви по активирани гаранции по заеми от  банки в страната",0,0,0,0,0,0,0,0,""]
[375,null,{"v":2969,"d":"29-69"},"Платени лихви по активирани гаранции по заеми от международни организации и институции",0,0,0,0,0,0,0,0,""]
[380,null,{"v":2970,"d":"29-70"},"Платени лихви по активирани гаранции по заеми от банки и финансови институции от чужбина",0,0,0,0,0,0,0,0,""]
[385,null,{"v":2989,"d":"29-89"},"Възстановени суми по платени лихви по активирани гаранции (-)",0,0,0,0,0,0,0,0,""]
[390,null,{"v":2990,"d":"29-90"},"Платени лихви по заеми, предоставени от централния бюджет и бюджетни организации",0,0,0,0,0,0,0,0,""]
[390,null,{"v":2991,"d":"29-91"},"Други разходи за лихви към  местни лица",0,0,0,0,0,0,0,0,""]
[395,null,{"v":2992,"d":"29-92"},"Други разходи за лихви към чуждестранни лица",0,0,0,0,0,0,0,0,""]
[397,{"v":3300,"d":"33-00"},"Вноска в общия бюджет на Европейския съюз",null,{"$f":"SUMIF($B$607:$B$12313,$B249,E$607:E$12313)","v":0},0,0,0,0,0,0,0,""]
[398,null,{"v":3301,"d":"33-01"},"ресурс на база брутен национален доход",{"$f":"SUMIF($C$607:$C$12313,$C250,E$607:E$12313)","v":0},0,0,0,0,0,0,0,""]
[399,null,{"v":3302,"d":"33-02"},"ресурс на база данък върху добавената стойност",0,0,0,0,0,0,0,0,""]
[400,null,{"v":3303,"d":"33-03"},"корекция за Обединеното кралство",0,0,0,0,0,0,0,0,""]
[401,null,{"v":3304,"d":"33-04"},"традиционни собствени ресурси - мита",0,0,0,0,0,0,0,0,""]
[404,null,{"v":3306,"d":"33-06"},"участие във финансирането на брутното намаление за Нидерландия, Швеция, Дания и Австрия",0,0,0,0,0,0,0,0,{"$f":"(IF($E254<>0,$M$2,IF($L254<>0,$M$2,\"\")))","v":""}]
[404,{"v":3900,"d":"39-00"},"Здравно-осигурителни плащания",null,{"$f":"SUMIF($B$607:$B$12313,$B255,E$607:E$12313)","v":0},0,0,0,0,0,0,0,""]
[440,{"v":4000,"d":"40-00"},"Стипендии",null,0,0,0,0,0,0,0,0,""]
[450,{"v":4100,"d":"41-00"},"Пенсии",null,0,0,0,0,0,0,0,0,""]
[495,{"v":4200,"d":"42-00"},"Текущи трансфери, обезщетения и помощи за домакинствата",null,280,280,0,0,280,0,0,280,1]
[500,null,{"v":4201,"d":"42-01"},"обезщетения и помощи по социалното осигуряване",{"$f":"SUMIF($C$607:$C$12313,$C259,E$607:E$12313)","v":0},0,0,0,0,0,0,0,""]
[505,null,{"v":4202,"d":"42-02"},"обезщетения и помощи по социалното подпомагане",0,0,0,0,0,0,0,0,""]
[510,null,{"v":4214,"d":"42-14"},"обезщетения и помощи по решение на общинския съвет",0,0,0,0,0,0,0,0,""]
[515,null,{"v":4217,"d":"42-17"},"текущи трансфери за домакинства от средства на Европейския съюз",280,280,0,0,280,0,0,280,1]
[520,null,{"v":4218,"d":"42-18"},"текущи трансфери за домакинства по други международни програми и споразумения",0,0,0,0,0,0,0,0,""]
[525,null,{"v":4219,"d":"42-19"},"други текущи трансфери за домакинствата",0,0,0,0,0,0,0,0,""]
[635,{"v":4300,"d":"43-00"},"Субсидии и други текущи трансфери за нефинансови предприятия",null,{"$f":"SUMIF($B$607:$B$12313,$B265,E$607:E$12313)","v":0},0,0,0,0,0,0,0,""]
[640,null,{"v":4301,"d":"43-01"},"за текуща дейност",{"$f":"SUMIF($C$607:$C$12313,$C266,E$607:E$12313)","v":0},0,0,0,0,0,0,0,""]
[645,null,{"v":4302,"d":"43-02"},"за осъществяване на болнична помощ ",0,0,0,0,0,0,0,0,""]
[650,null,{"v":4309,"d":"43-09"},"други субсидии и плащания",0,0,0,0,0,0,0,0,""]
[655,{"v":4400,"d":"44-00"},"Субсидии и други текущи трансфери за финансови институции",null,{"$f":"SUMIF($B$607:$B$12313,$B269,E$607:E$12313)","v":0},0,0,0,0,0,0,0,""]
[665,{"v":4500,"d":"45-00"},"Субсидии и други текущи трансфери за юридически лица с нестопанска цел",null,0,0,0,0,0,0,0,0,""]
[675,{"v":4600,"d":"46-00"},"Разходи за членски внос и участие в нетърговски организации и дейности",null,0,0,0,0,0,0,0,0,""]
[685,{"v":4900,"d":"49-00"},"Предоставени текущи и капиталови трансфери за чужбина",null,0,0,0,0,0,0,0,0,""]
[690,null,{"v":4901,"d":"49-01"},"текущи трансфери за чужбина",{"$f":"SUMIF($C$607:$C$12313,$C273,E$607:E$12313)","v":0},0,0,0,0,0,0,0,""]
[695,null,{"v":4902,"d":"49-02"},"капиталови трансфери за чужбина",0,0,0,0,0,0,0,0,""]
[700,{"v":5100,"d":"51-00"},"Основен ремонт на дълготрайни материални активи",null,{"$f":"SUMIF($B$607:$B$12313,$B275,E$607:E$12313)","v":0},0,0,0,0,0,0,0,""]
[710,{"v":5200,"d":"52-00"},"Придобиване на дълготрайни материални активи",null,0,0,0,0,0,0,0,0,""]
[715,null,{"v":5201,"d":"52-01"},"придобиване на компютри и хардуер",{"$f":"SUMIF($C$607:$C$12313,$C277,E$607:E$12313)","v":0},0,0,0,0,0,0,0,""]
[720,null,{"v":5202,"d":"52-02"},"придобиване на сгради",0,0,0,0,0,0,0,0,""]
[725,null,{"v":5203,"d":"52-03"},"придобиване на друго оборудване, машини и съоръжения",0,0,0,0,0,0,0,0,""]
[730,null,{"v":5204,"d":"52-04"},"придобиване на транспортни средства",0,0,0,0,0,0,0,0,""]
[735,null,{"v":5205,"d":"52-05"},"придобиване на стопански инвентар",0,0,0,0,0,0,0,0,""]
[740,null,{"v":5206,"d":"52-06"},"изграждане на инфраструктурни обекти",0,0,0,0,0,0,0,0,""]
[745,null,{"v":5219,"d":"52-19"},"придобиване на други ДМА",0,0,0,0,0,0,0,0,""]
[750,{"v":5300,"d":"53-00"},"Придобиване на нематериални дълготрайни активи",null,{"$f":"SUMIF($B$607:$B$12313,$B284,E$607:E$12313)","v":0},0,0,0,0,0,0,0,""]
[755,null,{"v":5301,"d":"53-01"},"придобиване на програмни продукти и лицензи за програмни продукти",{"$f":"SUMIF($C$607:$C$12313,$C285,E$607:E$12313)","v":0},0,0,0,0,0,0,0,""]
[760,null,{"v":5309,"d":"53-09"},"придобиване на други нематериални дълготрайни активи",0,0,0,0,0,0,0,0,""]
[765,{"v":5400,"d":"54-00"},"Придобиване на земя",null,{"$f":"SUMIF($B$607:$B$12313,$B287,E$607:E$12313)","v":0},0,0,0,0,0,0,0,""]
[775,{"v":5500,"d":"55-00"},"Капиталови трансфери",null,0,0,0,0,0,0,0,0,""]
[780,null,{"v":5501,"d":"55-01"},"капиталови трансфери за нефинансови предприятия",{"$f":"SUMIF($C$607:$C$12313,$C289,E$607:E$12313)","v":0},0,0,0,0,0,0,0,""]
[785,null,{"v":5502,"d":"55-02"},"капиталови трансфери за финансови институции",0,0,0,0,0,0,0,0,""]
[790,null,{"v":5503,"d":"55-03"},"капиталови трансфери за организации с нестопанска цел",0,0,0,0,0,0,0,0,""]
[795,null,{"v":5504,"d":"55-04"},"капиталови трансфери за домакинствата",0,0,0,0,0,0,0,0,""]
[805,{"v":5700,"d":"57-00"},"Прираст на държавния резерв и изкупуване на земеделска продукция (включва и § 40-71)",null,{"$f":"SUMIF($B$607:$B$12313,$B293,E$607:E$12313)","v":0},0,0,0,0,0,0,0,""]
[810,null,{"v":5701,"d":"57-01"},"плащания за попълване на държавния резерв",{"$f":"SUMIF($C$607:$C$12313,$C294,E$607:E$12313)","v":0},0,0,0,0,0,0,0,""]
[815,null,{"v":5702,"d":"57-02"},"плащания за изкупуване на земеделска продукция",0,0,0,0,0,0,0,0,""]
[525,null,{"v":4071,"d":"40-71"},"постъпления от продажба на държавния резерв (-)",0,0,0,0,0,0,0,0,""]
[820,{"v":98,"d":"00-98"},"Резерв за непредвидени и неотложни разходи",null,{"$f":"SUMIF($B$607:$B$12313,$B297,E$607:E$12313)","v":0},0,0,0,0,0,0,0,""]
[821,{"$nulls":11},""]
[822,{"$nulls":11},""]
[823,{"$nulls":11},""]
[825,"ВСИЧКО","99-99","II. ВСИЧКО РАЗХОДИ - РЕКАПИТУЛАЦИЯ ПО ПАРАГРАФИ И ПОДПАРАГРАФИ",{"$f":"SUMIF($C$607:$C$12313,$C301,E$607:E$12313)","v":{"v":16504,"d":"16,504"}},{"v":16504,"d":"16,504"},0,0,{"v":16504,"d":"16,504"},0,0,{"v":16504,"d":"16,504"},1]
[{"$nulls":12},1]
[{"$nulls":12},1]
[{"$nulls":12},1]
{"$rows_empty":12}
[905]
[906]
[]
[907]
[]
[910]
[911]
[912]
[]
[]
[920]
[921]
[922]
[930]
[931]
[932]
[935]
[940]
[950]
[953]
[954]
[955]
[956]
[958]
[959]
[960]
[]
[]
[]
[]
[{"$nulls":12},1]
[null,{"$f":"$B$7","v":"ОТЧЕТНИ ДАННИ ПО ЕБК ЗА СМЕТКИТЕ ЗА СРЕДСТВАТА ОТ ЕВРОПЕЙСКИЯ СЪЮЗ - КСФ"},{"$nulls":10},1]
[{"$nulls":4},"за периода        от ","до",{"$nulls":6},1]
[null,{"$f":"$B$9","v":"ДЕТСКА ГРАДИНА \"НАРЦИС\""},null,null,{"$f":"$E$9","v":"2020-01-01"},{"$f":"$F$9","v":"2020-06-30"},{"$nulls":6},1]
[null,{"$f":"$B$10","v":"(наименование на разпоредителя с бюджет)"},{"$nulls":10},1]
[{"$nulls":12},1]
[null,{"$f":"$B$12","v":"Силистра"},null,null,"       код по ЕБК:",{"$f":"$F$12","v":"6905"},{"$nulls":6},1]
[null,{"$f":"$B$13","v":"(наименование на първостепенния разпоредител с бюджет)"},{"$nulls":10},1]
[{"$nulls":4},{"$f":"$E$15","v":98},{"$f":"+$F$15","v":"СЕС - КСФ"},{"$nulls":6},1]
[{"$nulls":7},"(в лева)",{"$nulls":3},"(в лева)",1]
[{"$nulls":3},"III-ІV. ТРАНСФЕРИ И ВРЕМЕННИ БЕЗЛИХВЕНИ ЗАЕМИ - РЕКАПИТУЛАЦИЯ","Уточнен план 2020 - ТРАНСФЕРИ и ВРЕМ. БЕЗЛ. ЗАЕМИ",{"$nulls":3},"     Отчет 2020 - ТРАНСФЕРИ и ВРЕМ. БЕЗЛ. ЗАЕМИ",{"$nulls":3},1]
[null,"§§","под-§§","НАИМЕНОВАНИЕ НА ПАРАГРАФИТЕ И ПОДПАРАГРАФИТЕ",{"$f":"E20","v":"Уточнен план                Общо"},"държавни дейности","местни дейности","дофинансиране","държавни дейности -ОТЧЕТ","местни дейности - ОТЧЕТ","дофинансиране - ОТЧЕТ","ОТЧЕТ                                    ОБЩО",1]
[1,"  ІІІ. ТРАНСФЕРИ",null," 03 ¦","(1)","(2)","(3)","(4)","(5)","(6)","(7)","(8)",1]
[2,{"$nulls":11},1]
[5,{"v":3000,"d":"30-00"},"Трансфери от ЦБ за други бюджети (нето)",null,{"$f":"SUM(E362:E374)","v":0},0,0,{"$f":"SUM(H362:H374)","v":0},0,0,{"$f":"SUM(K362:K374)","v":0},0,{"$f":"(IF($E361<>0,$M$2,IF($L361<>0,$M$2,\"\")))","v":""}]
[10,null,{"v":3020,"d":"30-20"},"трансфери между ЦБ и бюджети по държавния бюджет",{"$f":"F362+G362+H362","v":0},0,0,0,0,0,0,{"$f":"I362+J362+K362","v":0},""]
[20,null,{"v":3040,"d":"30-40"},"възстановени трансфери в ЦБ от бюджети на общини",0,0,0,0,0,0,0,{"$f":"I363+J363+K363","v":0},""]
[25,null,{"v":3041,"d":"30-41"},"обща субсидия и други трансфери за държавни дейности от ЦБ за общини",0,0,0,0,0,0,0,0,""]
[30,null,{"v":3042,"d":"30-42"},"обща изравнителна субсидия и други трансфери за местни дейности от ЦБ за общини",0,0,0,0,0,0,0,0,""]
[35,null,{"v":3043,"d":"30-43"},"целеви субсидии от ЦБ за капиталови разходи за общини",0,0,0,0,0,0,0,0,""]
[36,null,{"v":3048,"d":"30-48"},"други целеви трансфери от ЦБ за общини",0,0,0,0,0,0,0,0,""]
[45,null,{"v":3050,"d":"30-50"},"трансфери между ЦБ и Държавното обществено осигуряване",0,0,0,0,0,0,0,0,""]
[50,null,{"v":3061,"d":"30-61"},"трансфери между ЦБ и НЗОК",0,0,0,0,0,0,0,0,""]
[60,null,{"v":3081,"d":"30-81"},"трансфери между ЦБ и БНТ",0,0,0,0,0,0,0,0,""]
[null,null,{"v":3082,"d":"30-82"},"трансфери между ЦБ и БНР",0,0,0,0,0,0,0,0,""]
[65,null,{"v":3083,"d":"30-83"},"трансфери между ЦБ и БТА",0,0,0,0,0,0,0,0,""]
[65,null,{"v":3089,"d":"30-89"},"трансфери  между ЦБ и други бюджети",0,0,0,0,0,0,0,0,""]
[65,null,{"v":3090,"d":"30-90"},"други възстановени в ЦБ трансфери от бюджети",0,0,0,0,0,0,0,0,""]
[70,{"v":3100,"d":"31-00"},"Трансфери между бюджета на бюджетната организация и ЦБ (нето)",null,{"$f":"SUM(E376:E382)","v":0},0,0,{"$f":"SUM(H376:H382)","v":0},0,0,{"$f":"SUM(K376:K382)","v":0},0,""]
[75,null,{"v":3110,"d":"31-10"},"трансфери от/за ЦБ (+/-)",0,0,0,0,0,0,0,{"$f":"I376+J376+K376","v":0},""]
[80,null,{"v":3111,"d":"31-11"},"обща субсидия и други трансфери за държавни дейности от ЦБ за общини (+)",0,null,0,0,null,0,0,0,""]
[85,null,{"v":3112,"d":"31-12"},"обща изравнителна субсидия и други трансфери за местни дейности от ЦБ за общини (+)",0,0,null,0,0,null,0,0,""]
[90,null,{"v":3113,"d":"31-13"},"получени от общини целеви субсидии от ЦБ за капиталови разходи (+)",0,null,null,0,null,null,0,0,""]
[91,null,{"v":3118,"d":"31-18"},"получени от общини трансфери за други целеви разходи от ЦБ чрез  кодовете в СЕБРА 488 001 ххх-х",0,null,null,0,null,null,0,0,""]
[null,null,{"v":3128,"d":"31-28"},"получени от общини трансфери за други целеви разходи от ЦБ чрез кодове в СЕБРА 488 002 ххх-х",0,null,null,0,null,null,0,0,""]
[100,null,{"v":3120,"d":"31-20"},"възстановени трансфери за ЦБ (-)",0,null,null,0,null,null,0,0,""]
[115,{"v":3200,"d":"32-00"},"Предоставени субсидии от държавния бюджет за БАН и държавните висши училища (нето)",null,{"$f":"SUM(E384:E387)","v":0},0,0,{"$f":"SUM(H384:H387)","v":0},0,0,{"$f":"SUM(K384:K387)","v":0},0,""]
[120,null,{"v":3210,"d":"32-10"},"предоставени трансфери от ДБ за държавните висши училища",0,0,0,0,0,0,0,{"$f":"I384+J384+K384","v":0},""]
[125,null,{"v":3220,"d":"32-20"},"предоставени трансфери от ДБ за БАН",0,0,0,0,0,0,0,{"$f":"I385+J385+K385","v":0},""]
[130,null,{"v":3230,"d":"32-30"},"получени от държавните висши училища  трансфери от ДБ (+)",0,0,0,0,0,0,0,{"$f":"I386+J386+K386","v":0},""]
[135,null,{"v":3240,"d":"32-40"},"получени от БАН трансфери от ДБ (+)",0,0,0,0,0,0,0,{"$f":"I387+J387+K387","v":0},""]
[145,{"v":6000,"d":"60-00"},"Трансфери между ЦБ и сметки за средствата от ЕС (нето)",null,{"$f":"SUM(E389:E390)","v":0},0,0,{"$f":"SUM(H389:H390)","v":0},0,0,{"$f":"SUM(K389:K390)","v":0},0,""]
[150,null,{"v":6001,"d":"60-01"}," - получени трансфери (+)",0,null,null,0,null,null,0,{"$f":"I389+J389+K389","v":0},""]
[155,null,{"v":6002,"d":"60-02"}," - предоставени трансфери (-)",0,null,null,0,null,null,0,{"$f":"I390+J390+K390","v":0},""]
[160,{"v":6100,"d":"61-00"},"Трансфери между бюджети (нето)",null,{"$f":"SUM(E392:E395)","v":0},0,0,{"$f":"SUM(H392:H395)","v":0},{"$f":"SUM(I392:I395)","v":0},{"$f":"SUM(J392:J395)","v":0},{"$f":"SUM(K392:K395)","v":0},0,""]
[165,null,{"v":6101,"d":"61-01"},"трансфери между бюджети - получени трансфери (+)",0,0,0,0,0,0,0,{"$f":"I392+J392+K392","v":0},""]
[170,null,{"v":6102,"d":"61-02"},"трансфери между бюджети - предоставени трансфери (-)",0,0,0,0,0,0,0,{"$f":"I393+J393+K393","v":0},""]
[null,null,{"v":6105,"d":"61-05"},"трансфери от МТСП по програми за осигуряване на заетост (+/-)",0,0,0,0,0,0,0,{"$f":"I394+J394+K394","v":0},""]
[180,null,{"v":6109,"d":"61-09"},"вътрешни трансфери в системата на първостепенния разпоредител (+/-)",0,0,0,0,0,0,0,{"$f":"I395+J395+K395","v":0},""]
[185,{"v":6200,"d":"62-00"},"Трансфери между бюджети и сметки за средствата от ЕС (нето)",null,{"$f":"SUM(E397:E398)","v":0},0,0,{"$f":"SUM(H397:H398)","v":0},0,0,{"$f":"SUM(K397:K398)","v":0},0,""]
[190,null,{"v":6201,"d":"62-01"},"- получени трансфери (+/-)",0,null,null,0,null,null,0,{"$f":"I397+J397+K397","v":0},""]
[195,null,{"v":6202,"d":"62-02"},"- предоставени трансфери (+/-)",0,null,null,0,null,null,0,{"$f":"I398+J398+K398","v":0},""]
[200,{"v":6300,"d":"63-00"},"Трансфери между сметки за средствата от ЕС (нето)",null,{"$f":"SUM(E400:E401)","v":{"v":12290,"d":"12,290"}},{"v":12290,"d":"12,290"},0,{"$f":"SUM(H400:H401)","v":0},{"v":12290,"d":"12,290"},0,{"$f":"SUM(K400:K401)","v":0},{"v":12290,"d":"12,290"},1]
[205,null,{"v":6301,"d":"63-01"},"- получени трансфери (+/-)",{"v":12290,"d":"12,290"},{"v":12290,"d":"12,290"},null,0,{"v":12290,"d":"12,290"},null,0,{"$f":"I400+J400+K400","v":{"v":12290,"d":"12,290"}},1]
[206,null,{"v":6302,"d":"63-02"},"- предоставени трансфери (-)",0,null,null,0,null,null,0,{"$f":"I401+J401+K401","v":0},""]
[210,{"v":6400,"d":"64-00"},"Трансфери от/за държавни предприятия и други лица, включени в КФП",null,{"$f":"SUM(E403:E404)","v":0},0,0,{"$f":"SUM(H403:H404)","v":0},0,0,{"$f":"SUM(K403:K404)","v":0},0,""]
[211,null,{"v":6401,"d":"64-01"},"- получени трансфери (+)",0,null,null,0,null,null,0,{"$f":"I403+J403+K403","v":0},""]
[212,null,{"v":6402,"d":"64-02"},"- предоставени трансфери (-)",0,null,null,0,null,null,0,{"$f":"I404+J404+K404","v":0},""]
[213,{"v":6500,"d":"65-00"},"Трансфери на отчислени постъпления",null,0,null,null,0,null,null,0,{"$f":"I405+J405+K405","v":0},""]
[215,{"v":6600,"d":"66-00"},"Разчети за извършени плащания в СЕБРА (+/-)",null,{"$f":"SUM(E407:E408)","v":0},0,0,{"$f":"SUM(H407:H408)","v":0},0,0,{"$f":"SUM(K407:K408)","v":0},0,""]
[220,null,{"v":6601,"d":"66-01"},"Разчети с подведомствени разпоредители за плащания в СЕБРА  (-)",0,0,0,0,0,0,0,{"$f":"I407+J407+K407","v":0},""]
[225,null,{"v":6602,"d":"66-02"},"Разчети с първостепенен разпоредител за плащания в СЕБРА  (+)",0,0,0,0,0,0,0,{"$f":"I408+J408+K408","v":0},""]
[215,{"v":6700,"d":"67-00"},"Трансфери от/за сметки за чужди средства",null,{"$f":"SUM(E410:E411)","v":0},0,0,{"$f":"SUM(H410:H411)","v":0},0,0,{"$f":"SUM(K410:K411)","v":0},0,""]
[220,null,{"v":6701,"d":"67-01"},"трансфери от/за сметки за чужди средства - получени трансфери (+)",0,null,null,0,null,null,0,{"$f":"I410+J410+K410","v":0},""]
[225,null,{"v":6702,"d":"67-02"},"трансфери от/за сметки за чужди средства - предоставени трансфери (-)",0,null,null,0,null,null,0,{"$f":"I411+J411+K411","v":0},""]
[230,{"v":6900,"d":"69-00"},"Трансфери за поети осигурителни вноски и данъци",null,{"$f":"SUM(E413:E418)","v":0},0,0,{"$f":"SUM(H413:H418)","v":0},0,0,{"$f":"SUM(K413:K418)","v":0},0,""]
[235,null,{"v":6901,"d":"69-01"},"Трансфери за поети данъци върху доходите на физически лица",0,0,0,0,0,0,0,{"$f":"I413+J413+K413","v":0},""]
[240,null,{"v":6905,"d":"69-05"},"Трансфери за поети осигурителни вноски за ДОО",0,0,0,0,0,0,0,0,""]
[240,null,{"v":6906,"d":"69-06"},"Трансфери за поети осигурителни вноски за здравно осигуряване",0,0,0,0,0,0,0,0,""]
[245,null,{"v":6907,"d":"69-07"},"Трансфери за поети осигурителни вноски за ДЗПО",0,0,0,0,0,0,0,0,""]
[250,null,{"v":6908,"d":"69-08"},"Корективен трансфер за поети осигурителни вноски и данъци",0,0,0,0,0,0,0,0,""]
[255,null,{"v":6909,"d":"69-09"},"Разпределени суми на трансфери за поети осигурителни вноски и данъци (-)",0,0,0,0,0,0,0,0,""]
[260,"ВСИЧКО","99-99","III. ВСИЧКО ТРАНСФЕРИ",{"$f":"SUM(E361,E375,E383,E388,E391,E396,E399,E402,E405,E406,E409,E412)","v":{"v":12290,"d":"12,290"}},{"v":12290,"d":"12,290"},0,{"$f":"SUM(H361,H375,H383,H388,H391,H396,H399,H402,H405,H406,H409,H412)","v":0},{"v":12290,"d":"12,290"},0,{"$f":"SUM(K361,K375,K383,K388,K391,K396,K399,K402,K405,K406,K409,K412)","v":0},{"v":12290,"d":"12,290"},1]
[261,"ІV. ВР.БЕЗЛ.ЗАЕМИ",null," 04 ¦",{"$nulls":8},""]
[262,{"$nulls":11},""]
[265,{"v":7400,"d":"74-00"},"Получени/предоставени временни безлихвени заеми от/за ЦБ (нето)",null,{"$f":"F422+G422+H422","v":0},0,0,0,0,0,0,{"$f":"I422+J422+K422","v":0},""]
[275,{"v":7500,"d":"75-00"},"Временни безлихвени заеми между бюджети (нето)",null,{"$f":"F423+G423+H423","v":0},0,0,0,0,0,0,{"$f":"I423+J423+K423","v":0},""]
[285,{"v":7600,"d":"76-00"},"Временни безлихвени заеми между бюджети и сметки за средствата от ЕС (нето)",null,{"$f":"F424+G424+H424","v":0},null,null,0,null,null,0,{"$f":"I424+J424+K424","v":0},""]
[295,{"v":7700,"d":"77-00"},"Временни безлихвени заеми между сметки за средствата от ЕС (нето)",null,{"$f":"F425+G425+H425","v":0},null,null,0,null,null,0,{"$f":"I425+J425+K425","v":0},{"$f":"(IF($E425<>0,$M$2,IF($L425<>0,$M$2,\"\")))","v":""}]
[215,{"v":7800,"d":"78-00"},"Временни безлихвени заеми от/за държавни предприятия и други сметки, включени в КФП ",null,{"$f":"SUM(E427:E428)","v":0},0,0,{"$f":"SUM(H427:H428)","v":0},0,0,0,0,{"$f":"(IF($E426<>0,$M$2,IF($L426<>0,$M$2,\"\")))","v":""}]
[220,null,{"v":7833,"d":"78-33"},"Временни безлихвени заеми от/за сметки за чужди средства (нето) ",{"$f":"F427+G427+H427","v":0},null,null,0,null,null,0,{"$f":"I427+J427+K427","v":0},{"$f":"(IF($E427<>0,$M$2,IF($L427<>0,$M$2,\"\")))","v":""}]
[225,null,{"v":7888,"d":"78-88"},"Временни безлихвени заеми от/за държавни предприятия, включени в КФП (нето) ",{"$f":"F428+G428+H428","v":0},null,null,0,null,null,0,{"$f":"I428+J428+K428","v":0},{"$f":"(IF($E428<>0,$M$2,IF($L428<>0,$M$2,\"\")))","v":""}]
[315,"ВСИЧКО","99-99","IV. ВСИЧКО ВРЕМЕННИ БЕЗЛИХВЕНИ ЗАЕМИ",{"$f":"SUM(E422,E423,E424,E425,E426)","v":0},0,0,{"$f":"SUM(H422,H423,H424,H425,H426)","v":0},0,0,0,0,1]
[{"$nulls":12},1]
[{"$nulls":12},1]
[{"$nulls":12},1]
[null,{"$f":"$B$7","v":"ОТЧЕТНИ ДАННИ ПО ЕБК ЗА СМЕТКИТЕ ЗА СРЕДСТВАТА ОТ ЕВРОПЕЙСКИЯ СЪЮЗ - КСФ"},{"$nulls":10},1]
[{"$nulls":4},"за периода        от ","до",{"$nulls":6},1]
[null,{"$f":"$B$9","v":"ДЕТСКА ГРАДИНА \"НАРЦИС\""},null,null,{"$f":"$E$9","v":"2020-01-01"},{"$f":"$F$9","v":"2020-06-30"},{"$nulls":6},1]
[null,{"$f":"$B$10","v":"(наименование на разпоредителя с бюджет)"},{"$nulls":10},1]
[{"$nulls":12},1]
[null,{"$f":"$B$12","v":"Силистра"},null,null,"       код по ЕБК:",{"$f":"$F$12","v":"6905"},{"$nulls":6},1]
[null,{"$f":"$B$13","v":"(наименование на първостепенния разпоредител с бюджет)"},{"$nulls":10},1]
[{"$nulls":3},"ФИНАНСОВО-ПРАВНА ФОРМА",{"$f":"$E$15","v":98},{"$f":"+$F$15","v":"СЕС - КСФ"},{"$nulls":6},1]
[{"$nulls":7},"(в лева)",{"$nulls":3},"(в лева)",1]
[{"$nulls":4},"Уточнен план 2020 - БЮДЖЕТНО САЛДО",{"$nulls":3},"               Отчет 2020 - БЮДЖЕТНО САЛДО",{"$nulls":3},1]
[{"$nulls":3},"V.-VІ. БЮДЖЕТНО САЛДО и ФИНАНСИРАНЕ НА БЮДЖЕТНОТО САЛДО",{"$f":"E20","v":"Уточнен план                Общо"},"държавни дейности","местни дейности","дофинансиране","държавни дейности -ОТЧЕТ","местни дейности - ОТЧЕТ","дофинансиране - ОТЧЕТ","ОТЧЕТ                                    ОБЩО",1]
[{"$nulls":3}," 0 5  ¦","(1)","(2)","(3)","(4)","(5)","(6)","(7)","(8)",1]
[{"$nulls":3},"V. БЮДЖЕТНО САЛДО - ДЕФИЦИТ (-) / ИЗЛИШЪК (+)      (V.=I.-II.+III.+ІV.)",{"$f":"+E169-E301+E419+E429","v":{"v":-4214,"d":"(4,214)"}},{"v":-4214,"d":"-4,214"},0,0,{"v":-4214,"d":"-4,214"},0,0,{"v":-4214,"d":"(4,214)"},1]
[{"$nulls":3},"VІ. ФИНАНСИРАНЕ НА БЮДЖЕТНОТО САЛДО (VІ.=-V.)",{"$f":"+E597","v":{"v":4214,"d":"4,214"}},{"v":4214,"d":"4,214"},0,0,{"v":4214,"d":"4,214"},0,0,{"$f":"+L597","v":{"v":4214,"d":"4,214"}},1]
[{"$nulls":3},{"$f":"+IF(+SUM(E447:J447)=0,0,\"Контрола: дефицит/излишък = финансиране с обратен знак (V. + VІ. = 0)\")","v":0},0,{"$nulls":6},{"$f":"+L598","v":0},1]
[{"$nulls":12},1]
[null,{"$f":"$B$7","v":"ОТЧЕТНИ ДАННИ ПО ЕБК ЗА СМЕТКИТЕ ЗА СРЕДСТВАТА ОТ ЕВРОПЕЙСКИЯ СЪЮЗ - КСФ"},{"$nulls":10},1]
[{"$nulls":4},"за периода        от ","до",{"$nulls":6},1]
[null,{"$f":"$B$9","v":"ДЕТСКА ГРАДИНА \"НАРЦИС\""},null,null,{"$f":"$E$9","v":"2020-01-01"},{"$f":"$F$9","v":"2020-06-30"},{"$nulls":6},1]
[null,{"$f":"$B$10","v":"(наименование на разпоредителя с бюджет)"},{"$nulls":10},1]
[{"$nulls":12},1]
[null,{"$f":"$B$12","v":"Силистра"},null,null,"       код по ЕБК:",{"$f":"$F$12","v":"6905"},{"$nulls":6},1]
[{"$nulls":12},1]
[{"$nulls":3},"ФИНАНСОВО-ПРАВНА ФОРМА",{"$f":"$E$15","v":98},{"$f":"+$F$15","v":"СЕС - КСФ"},{"$nulls":6},1]
[{"$nulls":7},"(в лева)",{"$nulls":3},"(в лева)",1]
[null,"       VI. ОПЕРАЦИИ С ФИНАНСОВИ АКТИВИ И ПАСИВИ (финансиране на бюдж. салдо)",null,null,"Уточнен план 2020 - ФИНАНСИРАНЕ НА БЮДЖЕТНО САЛДО",{"$nulls":3},"Отчет 2020-ФИНАНСИРАНЕ НА БЮДЖЕТНО САЛДО",{"$nulls":3},1]
[null,"§§","под-§§","НАИМЕНОВАНИЕ НА ПАРАГРАФИТЕ И ПОДПАРАГРАФИТЕ",{"$f":"E20","v":"Уточнен план                Общо"},"държавни дейности","местни дейности","дофинансиране","държавни дейности -ОТЧЕТ","местни дейности - ОТЧЕТ","дофинансиране - ОТЧЕТ","ОТЧЕТ                                    ОБЩО",1]
[1,null,null," 0 6 ¦","(1)","(2)","(3)","(4)","(5)","(6)","(7)","(8)",1]
[5,{"v":7000,"d":"70-00"},"Придобиване на дялове, акции и съучастия (нето)",null,{"$f":"SUM(E462:E464)","v":0},0,0,{"$f":"SUM(H462:H464)","v":0},0,0,0,0,{"$f":"(IF($E461<>0,$M$2,IF($L461<>0,$M$2,\"\")))","v":""}]
[10,null,{"v":7001,"d":"70-01"},"придобиване на дялове и акции и увеличение на капитала и капиталовите резерви (-)",{"$f":"F462+G462+H462","v":0},null,null,0,null,null,0,{"$f":"I462+J462+K462","v":0},""]
[20,null,{"v":7003,"d":"70-03"},"участия в съвместни предприятия, активи и стопански дейности (-)",{"$f":"F463+G463+H463","v":0},null,null,0,null,null,0,{"$f":"I463+J463+K463","v":0},""]
[25,null,{"v":7010,"d":"70-10"},"постъпления от продажби на дялове, акции, съучастия, и от ликвидационни дялове (+)",{"$f":"F464+G464+H464","v":0},null,null,0,null,null,0,{"$f":"I464+J464+K464","v":0},""]
[30,{"v":7100,"d":"71-00"},"Предоставени кредити (нето)",null,{"$f":"+E466+E467","v":0},0,0,{"$f":"+H466+H467","v":0},0,0,0,0,""]
[35,null,{"v":7101,"d":"71-01"},"предоставени средства по лихвени заеми (-)",{"$f":"F466+G466+H466","v":0},null,null,0,null,null,0,{"$f":"I466+J466+K466","v":0},""]
[40,null,{"v":7102,"d":"71-02"},"възстановени главници по предоставени лихвени заеми (+)",{"$f":"F467+G467+H467","v":0},null,null,0,null,null,0,{"$f":"I467+J467+K467","v":0},""]
[45,{"v":7200,"d":"72-00"},"Предоставена възмездна финансова помощ (нето)",null,{"$f":"+E469+E470","v":0},0,0,{"$f":"+H469+H470","v":0},0,0,0,0,""]
[50,null,{"v":7201,"d":"72-01"},"предоставени средства по възмездна финансова помощ (-)",{"$f":"F469+G469+H469","v":0},null,null,0,null,null,0,{"$f":"I469+J469+K469","v":0},""]
[55,null,{"v":7202,"d":"72-02"},"възстановени суми по възмездна финансова помощ (+)",{"$f":"F470+G470+H470","v":0},null,null,0,null,null,0,{"$f":"I470+J470+K470","v":0},""]
[60,{"v":7300,"d":"73-00"},"Плащания по активирани гаранции, поръчителства и преоформен държавен дълг (нето)",null,{"$f":"SUM(E472:E477)","v":0},0,0,{"$f":"SUM(H472:H477)","v":0},0,0,0,0,""]
[65,null,{"v":7320,"d":"73-20"},"Погашения по активирани гаранции по заеми от  банки в страната",{"$f":"F472+G472+H472","v":0},null,null,0,null,null,0,{"$f":"I472+J472+K472","v":0},""]
[85,null,{"v":7369,"d":"73-69"},"Погашения по активирани гаранции по заеми от международни организации и институции",0,null,null,0,null,null,0,0,""]
[90,null,{"v":7370,"d":"73-70"},"Погашения по активирани гаранции по заеми от банки и финансови институции от чужбина",0,null,null,0,null,null,0,0,""]
[95,null,{"v":7391,"d":"73-91"},"възстановени средства по активирани гаранции и поръчителства (+)",0,null,null,0,null,null,0,0,""]
[100,null,{"v":7392,"d":"73-92"},"вноски от предприятия по преоформен държавен дълг (+)",0,0,0,0,0,0,0,0,""]
[105,null,{"v":7393,"d":"73-93"},"получени суми от банки в несъстоятелност (+)",0,null,null,0,null,null,0,0,""]
[110,{"v":7900,"d":"79-00"},"Предоставени заеми към крайни бенефициенти по държавни инвестиционни заеми (нето)",null,{"$f":"+E479+E480","v":0},0,0,{"$f":"+H479+H480","v":0},0,0,0,0,""]
[115,null,{"v":7901,"d":"79-01"},"предоставени заеми на крайни бенефициенти (-)",{"$f":"F479+G479+H479","v":0},0,0,0,0,0,0,{"$f":"I479+J479+K479","v":0},""]
[120,null,{"v":7902,"d":"79-02"},"възстановени суми по предоставени заеми на крайни бенефиценти (+)",{"$f":"F480+G480+H480","v":0},0,0,0,0,0,0,{"$f":"I480+J480+K480","v":0},""]
[125,{"v":8000,"d":"80-00"},"Заеми от чужбина - нето (+/-)",null,{"$f":"SUM(E482:E496)","v":0},0,0,{"$f":"SUM(H482:H496)","v":0},0,0,0,0,""]
[130,null,{"v":8011,"d":"80-11"},"получени краткосрочни заеми от други държави (+)",{"$f":"F482+G482+H482","v":0},null,null,0,null,null,0,{"$f":"I482+J482+K482","v":0},""]
[135,null,{"v":8012,"d":"80-12"},"получени дългосрочни заеми от други държави (+)",0,null,null,0,null,null,0,0,""]
[140,null,{"v":8017,"d":"80-17"},"погашения по краткосрочни заеми от други държави (-)",0,null,null,0,null,null,0,0,""]
[145,null,{"v":8018,"d":"80-18"},"погашения по дългосрочни заеми от други държави (-)",0,null,null,0,null,null,0,0,""]
[150,null,{"v":8031,"d":"80-31"},"получени краткосрочни заеми от международни организации (+)",0,null,null,0,null,null,0,0,""]
[155,null,{"v":8032,"d":"80-32"},"получени дългосрочни заеми от международни организации (+)",0,null,null,0,null,null,0,0,""]
[175,null,{"v":8037,"d":"80-37"},"погашения по краткосрочни заеми от международни организации (-)",0,null,null,0,null,null,0,0,""]
[180,null,{"v":8038,"d":"80-38"},"погашения по дългосрочнизаеми от международни организации (-)",0,null,null,0,null,null,0,0,""]
[185,null,{"v":8051,"d":"80-51"},"получени краткосрочни заеми от банки и финансови институции от чужбина (+)",0,null,null,0,null,null,0,0,""]
[190,null,{"v":8052,"d":"80-52"},"получени дългосрочни заеми от банки и финансови институции от чужбина (+)",0,null,null,0,null,null,0,0,""]
[195,null,{"v":8057,"d":"80-57"},"погашения по краткосрочни заеми от банки и финансови институции от чужбина (-)",0,null,null,0,null,null,0,0,""]
[200,null,{"v":8058,"d":"80-58"},"погашения по дългосрочни заеми от банки и финансови институции от чужбина (-)",0,null,null,0,null,null,0,0,""]
[205,null,{"v":8080,"d":"80-80"},"клирингови разчети - пасивни и активни салда (-/+)",0,0,0,0,0,0,0,0,""]
[210,null,{"v":8097,"d":"80-97"},"друго финансиране от чужбина (+)",0,0,0,0,0,0,0,0,""]
[215,null,{"v":8098,"d":"80-98"},"други погашения и плащания по финансиране от чужбина (-)",0,0,0,0,0,0,0,0,""]
[220,{"v":8100,"d":"81-00"},"Държавни (общински) ценни книжа емитирани на международните капиталови пазари",null,{"$f":"SUM(E498:E501)","v":0},0,0,{"$f":"SUM(H498:H501)","v":0},0,0,0,0,""]
[225,null,{"v":8111,"d":"81-11"},"краткосрочни  ДЦК (ОбЦК) емитирани на международните капиталови пазари (+)",{"$f":"F498+G498+H498","v":0},0,0,0,0,0,0,{"$f":"I498+J498+K498","v":0},""]
[230,null,{"v":8112,"d":"81-12"},"дългосрочни ДЦК (ОбЦК) емитирани на международните капиталови пазари (+)",{"$f":"F499+G499+H499","v":0},0,0,0,0,0,0,{"$f":"I499+J499+K499","v":0},""]
[235,null,{"v":8121,"d":"81-21"},"погашения по  краткосрочни ДЦК (ОбЦК) емитирани на международните капиталови пазари (-)",{"$f":"F500+G500+H500","v":0},0,0,0,0,0,0,{"$f":"I500+J500+K500","v":0},""]
[240,null,{"v":8122,"d":"81-22"},"погашения по дългосрочни ДЦК (ОбЦК) емитирани на международните капиталови пазари (-)",{"$f":"F501+G501+H501","v":0},0,0,0,0,0,0,{"$f":"I501+J501+K501","v":0},""]
[245,{"v":8200,"d":"82-00"},"Получени погашения по предоставени кредити на други държави (+)",null,{"$f":"F502+G502+H502","v":0},0,0,0,0,0,0,{"$f":"I502+J502+K502","v":0},""]
[255,{"v":8300,"d":"83-00"},"Заеми от банки и други лица в страната - нето (+/-)",null,{"$f":"SUM(E504:E511)","v":0},0,0,{"$f":"SUM(H504:H511)","v":0},0,0,0,0,""]
[260,null,{"v":8311,"d":"83-11"},"получени краткосрочни заеми от банки в страната (+)",{"$f":"F504+G504+H504","v":0},null,null,0,null,null,0,{"$f":"I504+J504+K504","v":0},""]
[261,null,{"v":8312,"d":"83-12"},"получени дългосрочни заеми от банки в страната (+)",0,null,null,0,null,null,0,0,""]
[262,null,{"v":8321,"d":"83-21"},"погашения по краткосрочни заеми от банки в страната (-)",0,null,null,0,null,null,0,0,""]
[263,null,{"v":8322,"d":"83-22"},"погашения по дългосрочни заеми от банки в страната (-)",0,null,null,0,null,null,0,0,""]
[264,null,{"v":8371,"d":"83-71"},"получени краткосрочни заеми от други лица  в страната (+)",0,null,null,0,null,null,0,0,""]
[265,null,{"v":8372,"d":"83-72"},"получени дългосрочни заеми от други лица в страната (+)",0,null,null,0,null,null,0,0,""]
[266,null,{"v":8381,"d":"83-81"},"погашения по краткосрочни заеми от други лица в страната (-)",0,null,null,0,null,null,0,0,""]
[267,null,{"v":8382,"d":"83-82"},"погашения по дългосрочни заеми от други лица в страната (-)",0,null,null,0,null,null,0,0,""]
[295,{"v":8500,"d":"85-00"},"Емисии на държавни (общински) ценни книжа (+)",null,{"$f":"SUM(E513:E515)","v":0},0,0,{"$f":"SUM(H513:H515)","v":0},0,0,0,0,""]
[300,null,{"v":8501,"d":"85-01"},"емисии на краткосрочни държавни (общински) ценни книжа (+)",{"$f":"F513+G513+H513","v":0},null,null,0,null,null,0,0,""]
[305,null,{"v":8502,"d":"85-02"},"емисии на дългосрочни държавни (общински) ценни книжа (+)",{"$f":"F514+G514+H514","v":0},null,null,0,null,null,0,0,""]
[310,null,{"v":8504,"d":"85-04"},"целеви емисии на дългосрочни държавни (общински) ценни книжа (+)",{"$f":"F515+G515+H515","v":0},null,null,0,null,null,0,0,""]
[315,{"v":8600,"d":"86-00"},"Погашения на държавни (общински) ценни книжа (-)",null,{"$f":"SUM(E517:E520)","v":0},0,0,{"$f":"SUM(H517:H520)","v":0},0,0,0,0,""]
[320,null,{"v":8611,"d":"86-11"},"погашения по краткосрочни държавни (общински) ценни книжа (-)",{"$f":"F517+G517+H517","v":0},null,null,0,null,null,0,0,""]
[325,null,{"v":8621,"d":"86-21"},"погашения по дългосрочни държавни (общински) ценни книжа (-)",{"$f":"F518+G518+H518","v":0},null,null,0,null,null,0,0,""]
[330,null,{"v":8623,"d":"86-23"},"погашения по целеви емисии на дългосрочни държавни (общински) ценни книжа (-)",{"$f":"F519+G519+H519","v":0},null,null,0,null,null,0,0,""]
[340,null,{"v":8640,"d":"86-40"},"погашения по ДЦК, емитирани за структурната реформа (-)",{"$f":"F520+G520+H520","v":0},0,0,0,0,0,0,0,""]
[295,{"v":8700,"d":"87-00"},"Разчети между първостепенни разпоредители  за централизация на средства и плащания в СЕБРА",null,{"$f":"SUM(E522:E523)","v":0},0,0,{"$f":"SUM(H522:H523)","v":0},0,0,0,0,""]
[300,null,{"v":8733,"d":"87-33"},"разчети между първостепенни разпоредители за централизация на средства (+/-)",{"$f":"F522+G522+H522","v":0},0,0,0,0,0,0,0,""]
[310,null,{"v":8766,"d":"87-66"},"разчети между първостепенни разпоредители за плащания в СЕБРА (+/-)",{"$f":"F523+G523+H523","v":0},0,0,0,0,0,0,0,""]
[355,{"v":8800,"d":"88-00"},"Събрани средства и извършени плащания за сметка на други бюджети, сметки и фондове ",null,{"$f":"SUM(E525:E530)","v":{"v":4214,"d":"4,214"}},{"v":4214,"d":"4,214"},0,{"$f":"SUM(H525:H530)","v":0},{"v":4214,"d":"4,214"},0,0,{"v":4214,"d":"4,214"},1]
[360,null,{"v":8801,"d":"88-01"},"събрани средства и извършени плащания от/за ЦБ (+/-)",{"$f":"F525+G525+H525","v":0},0,0,0,0,0,0,0,{"$f":"(IF($E525<>0,$M$2,IF($L525<>0,$M$2,\"\")))","v":""}]
[365,null,{"v":8802,"d":"88-02"},"събрани средства и извършени плащания от/за бюджети по държавния бюджет (+/-)",0,null,null,0,null,null,0,0,""]
[365,null,{"v":8803,"d":"88-03"},"събрани средства и извършени плащания от/за сметки за средствата от Европейския съюз ",{"v":4214,"d":"4,214"},{"v":4214,"d":"4,214"},null,0,{"v":4214,"d":"4,214"},null,0,{"v":4214,"d":"4,214"},1]
[370,null,{"v":8804,"d":"88-04"},"събрани средства и извършени плащания от/за общински бюджети (+/-)",0,0,0,0,0,0,0,0,""]
[365,null,{"v":8805,"d":"88-05"},"събрани средства и извършени плащания от/за социалноосигурителни фондове (+/-)",0,null,null,0,null,null,0,0,""]
[370,null,{"v":8809,"d":"88-09"},"събрани средства и извършени плащания от/за други бюджети (+/-)",0,0,0,0,0,0,0,0,""]
[375,{"v":8900,"d":"89-00"},"Суми по разчети за поети осигурителни вноски и данъци",null,{"$f":"SUM(E532:E534)","v":0},0,0,{"$f":"SUM(H532:H534)","v":0},0,0,0,0,""]
[380,null,{"v":8901,"d":"89-01"},"суми по разчети м/у ЦБ,НОИ, НЗОК и НАП за поети осигурителни вноски",{"$f":"F532+G532+H532","v":0},0,0,0,0,0,0,0,""]
[385,null,{"v":8902,"d":"89-02"},"суми по разчети м/у ЦБ и бюджетните организации за поети осигурителни вноски и данъци",0,0,0,0,0,0,0,0,""]
[390,null,{"v":8903,"d":"89-03"},"суми по разчети м/у бюджети, сметки и фондове за поети осигурителни вноски и данъци",0,0,0,0,0,0,0,0,""]
[395,{"v":9000,"d":"90-00"},"Приватизация на дялове, акции и участия",null,0,null,null,0,null,null,0,0,""]
[405,{"v":9100,"d":"91-00"},"Покупко-продажба на държавни (общински) ценни книжа от бюджетни организации - нето  (+/-)",null,{"$f":"SUM(E537:E540)","v":0},0,0,{"$f":"SUM(H537:H540)","v":0},0,0,0,0,""]
[410,null,{"v":9111,"d":"91-11"},"покупка на държавни (общински) ценни книжа на първичния пазар (-)",0,null,null,0,null,null,0,0,""]
[415,null,{"v":9112,"d":"91-12"},"покупка на държавни (общински) ценни книжа на вторичния пазар (-)",0,null,null,0,null,null,0,0,""]
[420,null,{"v":9121,"d":"91-21"},"продажба на държавни (общински) ценни книжа (+)",0,null,null,0,null,null,0,0,""]
[425,null,{"v":9122,"d":"91-22"},"получени погашения по държавни (общински) ценни книжа (+)",0,null,null,0,null,null,0,0,""]
[430,{"v":9200,"d":"92-00"},"Операции с други ценни книжа и финансови активи за управление на ликвидността - нето (+/-)",null,{"$f":"+E542+E543","v":0},0,0,{"$f":"+H542+H543","v":0},0,0,0,0,""]
[435,null,{"v":9201,"d":"92-01"},"с чуждестранни ценни книжа и финасови активи (+/-)",0,null,null,0,null,null,0,0,""]
[440,null,{"v":9202,"d":"92-02"},"с ценни книжа и финансови активи на местни лица /резиденти/ (+/-)",0,null,null,0,null,null,0,0,""]
[445,{"v":9300,"d":"93-00"},"Друго финансиране - нето(+/-)",null,{"$f":"SUM(E545:E565)","v":0},0,0,{"$f":"SUM(H545:H565)","v":0},0,0,0,0,""]
[450,null,{"v":9301,"d":"93-01"},"чужди средства от държавни/общински предприятия (+/-)",0,null,null,0,null,null,0,0,""]
[450,null,{"v":9310,"d":"93-10"},"чужди средства от други лица (небюджетни предприятия и физически лица) (+/-)",0,null,null,0,null,null,0,0,""]
[451,null,{"v":9317,"d":"93-17"},"задължения по финансов лизинг и търговски кредит (+)",0,null,null,0,null,null,0,0,""]
[452,null,{"v":9318,"d":"93-18"},"погашения по финансов лизинг и търговски кредит (-)",0,null,null,0,null,null,0,0,""]
[456,null,{"v":9321,"d":"93-21"},"плащания за сметка на Европейския съюз - директни плащания на земеделски производители (-)",0,0,0,0,0,0,0,0,""]
[457,null,{"v":9322,"d":"93-22"},"възстановени суми от Европейския съюз - директни плащания на земеделски производители (+)",0,0,0,0,0,0,0,0,""]
[458,null,{"v":9323,"d":"93-23"},"плащания за сметка на Европейския съюз - средства от ЕЗФРСР, прехвърлени към директни плащания (-)",0,0,0,0,0,0,0,0,""]
[459,null,{"v":9324,"d":"93-24"},"възстановени суми от Европейския съюз - средства от ЕЗФРСР, прехвърлени към директни плащания (+)",0,0,0,0,0,0,0,0,""]
[460,null,{"v":9325,"d":"93-25"},"плащания за сметка на Европейския съюз - пазарни мерки  (-)",0,0,0,0,0,0,0,0,""]
[461,null,{"v":9326,"d":"93-26"},"възстановени суми от Европейския съюз - пазарни мерки (+)",0,0,0,0,0,0,0,0,""]
[null,null,{"v":9327,"d":"93-27"},"плащания за сметка на средства на Европейския съюз от суми за преструктуриране (-)",0,0,0,0,0,0,0,0,""]
[null,null,{"v":9328,"d":"93-28"}," постъпления от Европейския съюз - суми за преструктуриране (+)",0,0,0,0,0,0,0,0,""]
[462,null,{"v":9330,"d":"93-30"},"суми по разчети с централния бюджет за финансиране на плащания при недостиг на средства по сметки (+/-)",0,null,null,0,null,null,0,0,""]
[null,null,{"v":9336,"d":"93-36"},"друго финансиране - операции с активи - предоставени временни депозити и гаранции на други бюджетни организации (-/+)",0,null,null,0,null,null,0,0,""]
[462,null,{"v":9337,"d":"93-37"},"друго финансиране - операции с пасиви - получени временни депозити и гаранции от други бюджетни организации (-/+)",0,null,null,0,null,null,0,0,""]
[null,null,{"v":9338,"d":"93-38"},"друго финансиране - операции с активи (+/-)",0,null,null,0,null,null,0,0,""]
[462,null,{"v":9339,"d":"93-39"},"друго финансиране - операции с пасиви (+/-)",0,null,null,0,null,null,0,0,""]
[null,null,{"v":9355,"d":"93-55"},"събрани суми за допълнително задължително пенсионно осигуряване (+)",0,0,0,0,0,0,0,0,""]
[462,null,{"v":9356,"d":"93-56"},"разпределени суми за допълнително задължително пенсионно осигуряване (-)",0,0,0,0,0,0,0,0,""]
[462,null,{"v":9395,"d":"93-95"},"получени парични наличности при преобразуване на бюджетни организации (+)",0,null,null,0,null,null,0,0,""]
[465,null,{"v":9396,"d":"93-96"},"прехвърлени парични наличности при преобразуване на бюджетни организации (-)",0,null,null,0,null,null,0,0,""]
[470,{"v":9500,"d":"95-00"},"Депозити и средства по сметки - нето (+/-)   ",null,{"$f":"SUM(E567:E585)","v":0},0,0,{"$f":"SUM(H567:H585)","v":0},0,0,0,0,""]
[475,null,{"v":9501,"d":"95-01"},"остатък в левове по сметки от предходния период (+)",0,null,null,0,null,null,0,0,""]
[480,null,{"v":9502,"d":"95-02"},"остатък в левова равностойност по валутни сметки от предходния период (+)",0,null,null,0,null,null,0,{"$f":"I568+J568+K568","v":0},""]
[485,null,{"v":9503,"d":"95-03"},"остатък в левове по депозити от предходния период (+)",0,null,null,0,null,null,0,0,""]
[490,null,{"v":9504,"d":"95-04"},"остатък в левова равностойност по депозити във валута от предходния период (+)",0,null,null,0,null,null,0,0,""]
[495,null,{"v":9505,"d":"95-05"},"остатък в касата в  левове от предходния период (+)",0,null,null,0,null,null,0,0,""]
[500,null,{"v":9506,"d":"95-06"},"остътък  в касата във валута от предходния период (+)",0,null,null,0,null,null,0,0,""]
[505,null,{"v":9507,"d":"95-07"},"наличност в левове по сметки в края на периода (-)",0,null,null,0,null,null,0,0,""]
[510,null,{"v":9508,"d":"95-08"},"наличност в левова равностойност по валутни сметки в края на периода (-)",0,null,null,0,null,null,0,0,""]
[515,null,{"v":9509,"d":"95-09"},"наличност в левове по депозити в края на периода (-)",0,null,null,0,null,null,0,0,""]
[520,null,{"v":9510,"d":"95-10"},"наличност в левова равностойност по депозити във валута в края на периода (-)",0,null,null,0,null,null,0,0,""]
[525,null,{"v":9511,"d":"95-11"},"наличност в касата в левове в края на периода (-)",0,null,null,0,null,null,0,0,""]
[530,null,{"v":9512,"d":"95-12"},"наличност в касата във валута в края на периода (-)",0,null,null,0,null,null,0,0,""]
[535,null,{"v":9513,"d":"95-13"},"преводи в процес на сетълмент (-/+)",{"$f":"F579+G579+H579","v":0},null,null,0,null,null,0,0,""]
[540,null,{"v":9514,"d":"95-14"}," преоценка на валутни наличности (нереализирани курсови разлики) по сметки и средства в страната  (+/-)",0,null,null,0,null,null,0,0,""]
[545,null,{"v":9521,"d":"95-21"},"остатък в левова равностойност по валутни сметки  в чужбина от предходния период (+)",{"$f":"F581+G581+H581","v":0},null,null,0,null,null,0,0,""]
[550,null,{"v":9522,"d":"95-22"},"остатък в касата във валута  в чужбина от предходния период (+)",0,null,null,0,null,null,0,0,""]
[555,null,{"v":9528,"d":"95-28"},"наличност в касата във валута  в чужбина в края на периода (-)",0,null,null,0,null,null,0,0,""]
[560,null,{"v":9529,"d":"95-29"},"наличност в левова равностойност по валутни сметки в чужбина в края на периода(-)",0,null,null,0,null,null,0,0,""]
[561,null,{"v":9549,"d":"95-49"},"преоценка на валутни наличности (нереализирани курсови разлики) по сметки и средства в чужбина (+/-)",0,null,null,0,null,null,0,0,""]
[565,{"v":9600,"d":"96-00"},"Депозити и сметки консолидирани в системата на \"Единната сметка\"-нето (+/-)",null,{"$f":"SUM(E587:E590)","v":0},0,0,{"$f":"SUM(H587:H590)","v":0},0,0,0,0,""]
[566,null,{"v":9601,"d":"96-01"},"остатък по левови текущи сметки на бюджетните организации в БНБ от предходния период (+) ",0,0,0,0,0,0,0,{"$f":"I587+J587+K587","v":0},""]
[567,null,{"v":9603,"d":"96-03"},"остатък по левови депозити на бюджетните организации в БНБ от предходния период (+)",0,0,0,0,0,0,0,{"$f":"I588+J588+K588","v":0},""]
[568,null,{"v":9607,"d":"96-07"},"наличност по левови текущи сметки на бюджетните организации в БНБ в края на периода (-) ",0,0,0,0,0,0,0,{"$f":"I589+J589+K589","v":0},{"$f":"(IF($E589<>0,$M$2,IF($L589<>0,$M$2,\"\")))","v":""}]
[569,null,{"v":9609,"d":"96-09"},"наличност по левови депозити на бюджетните организации в БНБ в края на периода (-)",0,0,0,0,0,0,0,{"$f":"I590+J590+K590","v":0},""]
[575,{"v":9800,"d":"98-00"},"Касови операции, депозити, покупко-продажба на валута и сетълмент операции",null,{"$f":"SUM(E592:E596)","v":0},0,0,{"$f":"SUM(H592:H596)","v":0},0,0,0,0,""]
[580,null,{"v":9810,"d":"98-10"},"операции в брой между банка и каса (+/-)",0,null,null,0,null,null,0,{"$f":"I592+J592+K592","v":0},""]
[585,null,{"v":9820,"d":"98-20"},"предоставяне (възстановяване) на средства по срочни депозити (+/-)",0,null,null,0,null,null,0,{"$f":"I593+J593+K593","v":0},""]
[590,null,{"v":9830,"d":"98-30"},"покупко-продажба на валута (+/-)",0,null,null,0,null,null,0,{"$f":"I594+J594+K594","v":0},""]
[600,null,{"v":9850,"d":"98-50"},"операции СЕБРА - захранване на \"сметки за наличности\" (+/-)",0,null,null,0,null,null,0,{"$f":"I595+J595+K595","v":0},""]
[605,null,{"v":9890,"d":"98-90"},"салдо по сметката на ЦБ за разпределение на преводи от системата за брутен сетълмент в реално време (+/-)",{"$f":"F596+G596+H596","v":0},0,0,0,0,0,0,{"$f":"I596+J596+K596","v":0},""]
[610,"ВСИЧКО","99-99","VI. ВСИЧКО ОПЕРАЦИИ С ФИНАНСОВИ АКТИВИ И ПАСИВИ",{"$f":"SUM(E461,E465,E468,E471,E481,E497,E502,E503,E512,E516,E521,E478,E524,E531,E535,E536,E541,E544,E566,E586,E591)","v":{"v":4214,"d":"4,214"}},{"v":4214,"d":"4,214"},0,0,{"v":4214,"d":"4,214"},0,0,{"v":4214,"d":"4,214"},1]
[{"$nulls":3},{"$f":"+IF(+SUM(E598:J598)=0,0,\"Контрола: дефицит/излишък = финансиране с обратен знак (V. + VІ. = 0)\")","v":0},{"$f":"E597+E445","v":0},{"$nulls":6},{"$f":"L597+L445","v":0},1]
[{"$nulls":12},1]
[{"$nulls":5},"ГЛ. СЧЕТОВОДИТЕЛ:","Ел. Николова",{"$nulls":5},1]
[{"$nulls":6},"( име и фамилия)",{"$nulls":5},1]
[{"$nulls":12},1]
[null,null,"ИЗГОТВИЛ:","Ел. Николова",null,"РЪКОВОДИТЕЛ:","Пепа Добрева",{"$nulls":5},1]
[null,"дата",null,"                                                                      ( име и фамилия)",null,null,"( име и фамилия)",{"$nulls":5},1]
[{"$nulls":3},"служебни телефони ","086 82 38 91",null,"e-mail:","odz_narcis@abv.bg",{"$nulls":4},1]
[{"$nulls":12},1]
[{"$nulls":6},"Web-адрес:",{"$nulls":5},{"$f":"(IF(#REF!<>0,$M$2,IF(#REF!<>0,$M$2,\"\")))","v":{"$error":"#REF!"}}]
[]
[]
[]
[{"$nulls":12},{"$f":"(IF($E744<>0,$M$2,IF($L744<>0,$M$2,\"\")))","v":1}]
[{"$nulls":12},{"$f":"(IF($E744<>0,$M$2,IF($L744<>0,$M$2,\"\")))","v":1}]
[null,{"$f":"$B$7","v":"ОТЧЕТНИ ДАННИ ПО ЕБК ЗА СМЕТКИТЕ ЗА СРЕДСТВАТА ОТ ЕВРОПЕЙСКИЯ СЪЮЗ - КСФ"},{"$nulls":10},{"$f":"(IF($E744<>0,$M$2,IF($L744<>0,$M$2,\"\")))","v":1}]
[{"$nulls":4},"за периода от ","до",null,"        II.1. РАЗХОДИ ПО ДЕЙНОСТИ",{"$nulls":4},{"$f":"(IF($E744<>0,$M$2,IF($L744<>0,$M$2,\"\")))","v":1}]
[null,{"$f":"$B$9","v":"ДЕТСКА ГРАДИНА \"НАРЦИС\""},null,null,{"$f":"$E$9","v":"2020-01-01"},{"$f":"$F$9","v":"2020-06-30"},{"$nulls":6},{"$f":"(IF($E744<>0,$M$2,IF($L744<>0,$M$2,\"\")))","v":1}]
[null,{"$f":"$B$10","v":"(наименование на разпоредителя с бюджет)"},{"$nulls":10},{"$f":"(IF($E744<>0,$M$2,IF($L744<>0,$M$2,\"\")))","v":1}]
[{"$nulls":12},{"$f":"(IF($E744<>0,$M$2,IF($L744<>0,$M$2,\"\")))","v":1}]
[null,{"$f":"$B$12","v":"Силистра"},null,null,"       код по ЕБК:",{"$f":"$F$12","v":"6905"},{"$nulls":6},{"$f":"(IF($E744<>0,$M$2,IF($L744<>0,$M$2,\"\")))","v":1}]
[null,{"$f":"$B$13","v":"(наименование на първостепенния разпоредител с бюджет)"},{"$nulls":10},{"$f":"(IF($E744<>0,$M$2,IF($L744<>0,$M$2,\"\")))","v":1}]
[{"$nulls":3},"ФИНАНСОВО-ПРАВНА ФОРМА",{"$f":"$E$15","v":98},{"$f":"$F$15","v":"СЕС - КСФ"},{"$nulls":6},{"$f":"(IF($E744<>0,$M$2,IF($L744<>0,$M$2,\"\")))","v":1}]
[{"$nulls":11},"(в лева)",{"$f":"(IF($E744<>0,$M$2,IF($L744<>0,$M$2,\"\")))","v":1}]
[{"$nulls":3},"II.1. РАЗХОДИ ПО ДЕЙНОСТИ","Уточнен план 2020",{"$nulls":3},"Отчет 2020",{"$nulls":3},{"$f":"(IF($E744<>0,$M$2,IF($L744<>0,$M$2,\"\")))","v":1}]
[null,"§§","под-§§","НАИМЕНОВАНИЯ НА ПАРАГРАФИТЕ И ПОДПАРАГРАФИТЕ",{"$f":"$E$20","v":"Уточнен план                Общо"},{"$f":"$F$20","v":"държавни дейности"},{"$f":"$G$20","v":"местни дейности"},{"$f":"$H$20","v":"дофинансиране"},{"$f":"$I$20","v":"държавни дейности -ОТЧЕТ"},{"$f":"$J$20","v":"местни дейности - ОТЧЕТ"},{"$f":"$K$20","v":"дофинансиране - ОТЧЕТ"},{"$f":"$L$20","v":"ОТЧЕТ                                    ОБЩО"},{"$f":"(IF($E744<>0,$M$2,IF($L744<>0,$M$2,\"\")))","v":1}]
[{"$nulls":3}," 02 ¦",{"$f":"$E$21","v":"(1)"},{"$f":"$F$21","v":"(2)"},{"$f":"$G$21","v":"(3)"},{"$f":"$H$21","v":"(4)"},{"$f":"$I$21","v":"(5)"},{"$f":"$J$21","v":"(6)"},{"$f":"$K$21","v":"(7)"},{"$f":"$L$21","v":"(8)"},{"$f":"(IF($E744<>0,$M$2,IF($L744<>0,$M$2,\"\")))","v":1}]
[null,null,{"$f":"VLOOKUP(D625,OP_LIST2,2,FALSE)","v":0},"ИЗБЕРЕТЕ ОПЕРАТИВНА ПРОГРАМА ",{"$nulls":8},{"$f":"(IF($E744<>0,$M$2,IF($L744<>0,$M$2,\"\")))","v":1}]
[null,null,{"$f":"VLOOKUP(D627,EBK_DEIN2,2,FALSE)","v":3311},"<------          ДЕЙНОСТ    -  код  по  ЕБК",{"$nulls":8},{"$f":"(IF($E744<>0,$M$2,IF($L744<>0,$M$2,\"\")))","v":1}]
[null,null,{"$f":"+C626","v":3311},"311 Детски градини",{"$nulls":8},{"$f":"(IF($E744<>0,$M$2,IF($L744<>0,$M$2,\"\")))","v":1}]
[{"$nulls":3},"(наименование на дейността)",{"$nulls":8},{"$f":"(IF($E744<>0,$M$2,IF($L744<>0,$M$2,\"\")))","v":1}]
[null,{"v":100,"d":"01-00"},"Заплати и възнаграждения за персонала, нает по трудови и служебни правоотношения",null,{"$f":"SUM(E630:E631)","v":{"v":12491,"d":"12,491"}},{"v":12491,"d":"12,491"},0,{"$f":"SUM(H630:H631)","v":0},{"v":12491,"d":"12,491"},0,0,{"v":12491,"d":"12,491"},{"$f":"(IF($E629<>0,$M$2,IF($L629<>0,$M$2,\"\")))","v":1}]
[null,null,{"v":101,"d":"01-01"},"заплати и възнаграждения на персонала нает по трудови правоотношения",{"$f":"F630+G630+H630","v":{"v":12491,"d":"12,491"}},{"v":12491,"d":"12,491"},null,null,{"v":12491,"d":"12,491"},null,null,{"$f":"I630+J630+K630","v":{"v":12491,"d":"12,491"}},{"$f":"(IF($E630<>0,$M$2,IF($L630<>0,$M$2,\"\")))","v":1}]
[null,null,{"v":102,"d":"01-02"},"заплати и възнаграждения на персонала нает по служебни правоотношения",{"$f":"F631+G631+H631","v":0},{"$nulls":6},{"$f":"I631+J631+K631","v":0},""]
[null,{"v":200,"d":"02-00"},"Други възнаграждения и плащания за персонала",null,{"$f":"SUM(E633:E637)","v":683},683,0,{"$f":"SUM(H633:H637)","v":0},683,0,0,683,1]
[null,null,{"v":201,"d":"02-01"},"за нещатен персонал нает по трудови правоотношения ",{"$f":"F633+G633+H633","v":0},{"$nulls":6},{"$f":"I633+J633+K633","v":0},""]
[null,null,{"v":202,"d":"02-02"},"за персонала по извънтрудови правоотношения",{"$f":"F634+G634+H634","v":0},{"$nulls":6},{"$f":"I634+J634+K634","v":0},""]
[null,null,{"v":205,"d":"02-05"},"изплатени суми от СБКО за облекло и други на персонала, с характер на възнаграждение",{"$f":"F635+G635+H635","v":430},430,null,null,430,null,null,{"$f":"I635+J635+K635","v":430},1]
[null,null,{"v":208,"d":"02-08"},"обезщетения за персонала, с характер на възнаграждение",{"$f":"F636+G636+H636","v":0},{"$nulls":6},{"$f":"I636+J636+K636","v":0},""]
[null,null,{"v":209,"d":"02-09"},"другиплащания и възнаграждения",{"$f":"F637+G637+H637","v":253},253,null,null,253,null,null,{"$f":"I637+J637+K637","v":253},1]
[null,{"v":500,"d":"05-00"},"Задължителни осигурителни вноски от работодатели",null,{"$f":"SUM(E639:E645)","v":{"v":2567,"d":"2,567"}},{"v":2567,"d":"2,567"},0,{"$f":"SUM(H639:H645)","v":0},{"v":2567,"d":"2,567"},0,0,{"v":2567,"d":"2,567"},1]
[null,null,{"v":551,"d":"05-51"},"осигурителни вноски от работодатели за Държавното обществено осигуряване (ДОО)",{"$f":"F639+G639+H639","v":{"v":1292,"d":"1,292"}},{"v":1292,"d":"1,292"},null,null,{"v":1292,"d":"1,292"},null,null,{"$f":"I639+J639+K639","v":{"v":1292,"d":"1,292"}},1]
[null,null,{"v":552,"d":"05-52"},"осигурителни вноски от работодатели за Учителския пенсионен фонд (УчПФ)",380,380,null,null,380,null,null,380,1]
[null,null,{"v":558,"d":"05-58"},"вноски по чл. 4б и 4в от КСО за сметка на осигурителя",{"$f":"F641+G641+H641","v":0},0,0,0,0,0,0,{"$f":"I641+J641+K641","v":0},""]
[null,null,{"v":560,"d":"05-60"},"здравно-осигурителни вноски от работодатели",600,600,null,null,600,null,null,600,1]
[null,null,{"v":580,"d":"05-80"},"вноски за допълнително задължително осигуряване от работодатели",295,295,null,null,295,null,null,295,1]
[null,null,{"v":588,"d":"05-88"},"коректив на вноски за ДЗПО за сумите по чл. 4б и 4в от КСО за сметка на осигурителя",{"$f":"F644+G644+H644","v":0},0,0,0,0,0,0,{"$f":"I644+J644+K644","v":0},""]
[null,null,{"v":590,"d":"05-90"},"задължителни вноски за чуждестранни пенсионни фондове и  схеми за сметка на осигурителя",0,{"$nulls":6},0,""]
[5,{"v":800,"d":"08-00"},"Вноски за доброволно осигуряване  ",null,0,{"$nulls":6},0,""]
[10,{"v":1000,"d":"10-00"},"Издръжка",null,{"$f":"SUM(E648:E664)","v":483},483,0,{"$f":"SUM(H648:H664)","v":0},483,0,0,483,1]
[15,null,{"v":1011,"d":"10-11"},"Храна",{"$f":"F648+G648+H648","v":0},{"$nulls":6},{"$f":"I648+J648+K648","v":0},""]
[35,null,{"v":1012,"d":"10-12"},"Медикаменти",0,{"$nulls":6},0,""]
[40,null,{"v":1013,"d":"10-13"},"Постелен инвентар и облекло",380,380,null,null,380,null,null,380,1]
[45,null,{"v":1014,"d":"10-14"},"Учебни и научно-изследователски разходи и книги за библиотеките",0,{"$nulls":6},0,""]
[50,null,{"v":1015,"d":"10-15"},"материали",103,103,null,null,103,null,null,103,1]
[55,null,{"v":1016,"d":"10-16"},"вода, горива и енергия",0,{"$nulls":6},0,""]
[60,null,{"v":1020,"d":"10-20"},"разходи за външни услуги",0,{"$nulls":6},0,""]
[65,null,{"v":1030,"d":"10-30"},"Текущ ремонт",0,{"$nulls":6},0,""]
[70,null,{"v":1051,"d":"10-51"},"командировки в страната",0,{"$nulls":6},0,""]
[75,null,{"v":1052,"d":"10-52"},"краткосрочни командировки в чужбина",0,{"$nulls":6},0,""]
[80,null,{"v":1053,"d":"10-53"},"дългосрочни командировки в чужбина",0,{"$nulls":6},0,""]
[80,null,{"v":1062,"d":"10-62"},"разходи за застраховки",0,{"$nulls":6},0,""]
[85,null,{"v":1063,"d":"10-63"},"такса ангажимент по заеми",0,{"$nulls":6},0,""]
[90,null,{"v":1069,"d":"10-69"},"други финансови услуги",0,{"$nulls":6},0,""]
[90,null,{"v":1091,"d":"10-91"},"други разходи за СБКО",0,{"$nulls":6},0,""]
[115,null,{"v":1092,"d":"10-92"},"разходи за договорни санкции и неустойки, съдебни обезщетения и разноски",0,{"$nulls":6},0,""]
[125,null,{"v":1098,"d":"10-98"},"други разходи, некласифицирани в другите параграфи и подпараграфи",0,{"$nulls":6},0,""]
[130,{"v":1900,"d":"19-00"},"Платени данъци, такси и административни санкции",null,{"$f":"SUM(E666:E668)","v":0},0,0,{"$f":"SUM(H666:H668)","v":0},0,0,0,0,""]
[135,null,{"v":1901,"d":"19-01"},"платени държавни данъци, такси, наказателни лихви и административни санкции",{"$f":"F666+G666+H666","v":0},{"$nulls":6},{"$f":"I666+J666+K666","v":0},""]
[140,null,{"v":1981,"d":"19-81"},"платени общински данъци, такси, наказателни лихви и административни санкции",{"$f":"F667+G667+H667","v":0},{"$nulls":6},{"$f":"I667+J667+K667","v":0},""]
[145,null,{"v":1991,"d":"19-91"},"платени данъци, такси, наказателни лихви и административни санкции в чужбина",{"$f":"F668+G668+H668","v":0},{"$nulls":6},{"$f":"I668+J668+K668","v":0},""]
[150,{"v":2100,"d":"21-00"},"Разходи за лихви по емисии на държавни (общински) ценни книжа",null,{"$f":"SUM(E670:E674)","v":0},0,0,{"$f":"SUM(H670:H674)","v":0},0,0,0,0,""]
[155,null,{"v":2110,"d":"21-10"},"лихви по държавни (общински) ценни книжа",{"$f":"F670+G670+H670","v":0},{"$nulls":6},{"$f":"I670+J670+K670","v":0},""]
[160,null,{"v":2120,"d":"21-20"},"отстъпки по държавни (общински) ценни книжа",{"$f":"F671+G671+H671","v":0},{"$nulls":6},{"$f":"I671+J671+K671","v":0},""]
[165,null,{"v":2125,"d":"21-25"},"лихви и отстъпки по целеви емисии на държавни ценни книжа",{"$f":"F672+G672+H672","v":0},0,0,0,0,0,0,{"$f":"I672+J672+K672","v":0},""]
[175,null,{"v":2140,"d":"21-40"},"лихви по държавни ценни книжа, емитирани за структурната реформа ",{"$f":"F673+G673+H673","v":0},0,0,0,0,0,0,{"$f":"I673+J673+K673","v":0},""]
[180,null,{"v":2190,"d":"21-90"},"премии над номинала от емисии на държавни (общински) ценни книжа (-)",{"$f":"F674+G674+H674","v":0},{"$nulls":6},{"$f":"I674+J674+K674","v":0},""]
[185,{"v":2200,"d":"22-00"},"Разходи за лихви по заеми от страната",null,{"$f":"SUM(E676:E677)","v":0},0,0,{"$f":"SUM(H676:H677)","v":0},0,0,0,0,""]
[190,null,{"v":2221,"d":"22-21"},"Разходи за лихви по заеми от банки в страната",{"$f":"F676+G676+H676","v":0},{"$nulls":6},{"$f":"I676+J676+K676","v":0},""]
[200,null,{"v":2224,"d":"22-24"},"Разходи за лихви по други заеми от страната",0,{"$nulls":6},0,""]
[200,{"v":2500,"d":"25-00"},"Разходи за лихви по заеми от други държави",null,0,{"$nulls":6},0,""]
[205,{"v":2600,"d":"26-00"},"Разходи за лихви по заеми от международни организации и институции",null,0,{"$nulls":6},0,""]
[210,{"v":2700,"d":"27-00"},"Разходи за лихви по заеми от банки и други финансови институции от чужбина",null,0,{"$nulls":6},0,""]
[215,{"v":2800,"d":"28-00"},"Разходи за лихви и отстъпки по облигации, емитирани и търгувани на международните капиталови пазари",null,0,{"$nulls":6},0,""]
[220,{"v":2900,"d":"29-00"},"Други разходи за лихви",null,{"$f":"SUM(E683:E690)","v":0},{"$f":"SUM(F683:F690)","v":0},{"$f":"SUM(G683:G690)","v":0},0,0,0,0,0,""]
[225,null,{"v":2910,"d":"29-10"},"Платени лихви по финансов лизинг и търговски кредит",{"$f":"F683+G683+H683","v":0},{"$nulls":6},{"$f":"I683+J683+K683","v":0},""]
[230,null,{"v":2920,"d":"29-20"},"Платени лихви по активирани гаранции по заеми от  банки в страната",{"$f":"F684+G684+H684","v":0},{"$nulls":6},{"$f":"I684+J684+K684","v":0},""]
[245,null,{"v":2969,"d":"29-69"},"Платени лихви по активирани гаранции по заеми от международни организации и институции",0,{"$nulls":6},0,""]
[220,null,{"v":2970,"d":"29-70"},"Платени лихви по активирани гаранции по заеми от банки и финансови институции от чужбина",0,{"$nulls":6},0,""]
[225,null,{"v":2989,"d":"29-89"},"Възстановени суми по платени лихви по активирани гаранции (-)",0,{"$nulls":6},0,""]
[230,null,{"v":2990,"d":"29-90"},"Платени лихви по активирани гаранции по заеми от  банки в страната",{"$f":"F688+G688+H688","v":0},{"$nulls":6},{"$f":"I688+J688+K688","v":0},""]
[235,null,{"v":2991,"d":"29-91"},"Други разходи за лихви към  местни лица",0,{"$nulls":6},0,""]
[240,null,{"v":2992,"d":"29-92"},"Други разходи за лихви към чуждестранни лица",0,{"$nulls":6},0,""]
[245,{"v":3300,"d":"33-00"},"Вноска в общия бюджет на Европейския съюз",null,{"$f":"SUM(E692:E696)","v":0},0,0,0,0,0,0,0,""]
[250,null,{"v":3301,"d":"33-01"},"ресурс на база брутен национален доход",{"$f":"F692+G692+H692","v":0},0,0,0,0,0,0,{"$f":"I692+J692+K692","v":0},""]
[255,null,{"v":3302,"d":"33-02"},"ресурс на база данък върху добавената стойност",0,0,0,0,0,0,0,0,""]
[265,null,{"v":3303,"d":"33-03"},"корекция за Обединеното кралство",0,0,0,0,0,0,0,0,""]
[270,null,{"v":3304,"d":"33-04"},"традиционни собствени ресурси - мита",0,0,0,0,0,0,0,0,""]
[290,null,{"v":3306,"d":"33-06"},"участие във финансирането на брутното намаление за Нидерландия, Швеция, Дания и Австрия",0,0,0,0,0,0,0,0,""]
[320,{"v":3900,"d":"39-00"},"Здравно-осигурителни плащания",null,0,0,0,0,0,0,0,0,{"$f":"(IF($E697<>0,$M$2,IF($L697<>0,$M$2,\"\")))","v":""}]
[330,{"v":4000,"d":"40-00"},"Стипендии",null,0,{"$nulls":6},0,""]
[350,{"v":4100,"d":"41-00"},"Пенсии",null,0,0,0,0,0,0,0,0,""]
[355,{"v":4200,"d":"42-00"},"Текущи трансфери, обезщетения и помощи за домакинствата",null,{"$f":"SUM(E701:E706)","v":280},280,0,{"$f":"SUM(H701:H706)","v":0},280,0,0,280,1]
[355,null,{"v":4201,"d":"42-01"},"обезщетения и помощи по социалното осигуряване",{"$f":"F701+G701+H701","v":0},{"$nulls":6},{"$f":"I701+J701+K701","v":0},""]
[375,null,{"v":4202,"d":"42-02"},"обезщетения и помощи по социалното подпомагане",0,{"$nulls":6},0,""]
[380,null,{"v":4214,"d":"42-14"},"обезщетения и помощи по решение на общинския съвет",0,{"$nulls":6},0,""]
[385,null,{"v":4217,"d":"42-17"},"текущи трансфери за домакинства от средства на Европейския съюз",280,280,null,null,280,null,null,280,1]
[390,null,{"v":4218,"d":"42-18"},"текущи трансфери за домакинства по други международни програми и споразумения",0,{"$nulls":6},0,""]
[390,null,{"v":4219,"d":"42-19"},"други текущи трансфери за домакинствата",0,{"$nulls":6},0,""]
[395,{"v":4300,"d":"43-00"},"Субсидии и други текущи трансфери за нефинансови предприятия",null,{"$f":"SUM(E708:E710)","v":0},0,0,{"$f":"SUM(H708:H710)","v":0},0,0,0,0,""]
[397,null,{"v":4301,"d":"43-01"},"за текуща дейност",{"$f":"F708+G708+H708","v":0},{"$nulls":6},{"$f":"I708+J708+K708","v":0},""]
[398,null,{"v":4302,"d":"43-02"},"за осъществяване на болнична помощ ",0,{"$nulls":6},0,""]
[399,null,{"v":4309,"d":"43-09"},"други субсидии и плащания",0,{"$nulls":6},0,""]
[400,{"v":4400,"d":"44-00"},"Субсидии и други текущи трансфери за финансови институции",null,0,{"$nulls":6},0,""]
[401,{"v":4500,"d":"45-00"},"Субсидии и други текущи трансфери за юридически лица с нестопанска цел",null,0,{"$nulls":6},0,""]
[404,{"v":4600,"d":"46-00"},"Разходи за членски внос и участие в нетърговски организации и дейности",null,0,{"$nulls":6},0,""]
[404,{"v":4900,"d":"49-00"},"Предоставени текущи и капиталови трансфери за чужбина",null,{"$f":"+E715+E716","v":0},0,0,{"$f":"+H715+H716","v":0},0,0,0,0,""]
[440,null,{"v":4901,"d":"49-01"},"текущи трансфери за чужбина",{"$f":"F715+G715+H715","v":0},{"$nulls":6},{"$f":"I715+J715+K715","v":0},""]
[450,null,{"v":4902,"d":"49-02"},"капиталови трансфери за чужбина",{"$f":"F716+G716+H716","v":0},{"$nulls":6},{"$f":"I716+J716+K716","v":0},""]
[495,{"v":5100,"d":"51-00"},"Основен ремонт на дълготрайни материални активи",null,{"$f":"F717+G717+H717","v":0},{"$nulls":6},{"$f":"I717+J717+K717","v":0},""]
[500,{"v":5200,"d":"52-00"},"Придобиване на дълготрайни материални активи",null,{"$f":"SUM(E719:E725)","v":0},0,0,{"$f":"SUM(H719:H725)","v":0},0,0,0,0,""]
[505,null,{"v":5201,"d":"52-01"},"придобиване на компютри и хардуер",{"$f":"F719+G719+H719","v":0},{"$nulls":6},{"$f":"I719+J719+K719","v":0},""]
[510,null,{"v":5202,"d":"52-02"},"придобиване на сгради",0,{"$nulls":6},0,""]
[515,null,{"v":5203,"d":"52-03"},"придобиване на друго оборудване, машини и съоръжения",0,{"$nulls":6},0,""]
[520,null,{"v":5204,"d":"52-04"},"придобиване на транспортни средства",0,{"$nulls":6},0,""]
[525,null,{"v":5205,"d":"52-05"},"придобиване на стопански инвентар",0,{"$nulls":6},0,""]
[635,null,{"v":5206,"d":"52-06"},"изграждане на инфраструктурни обекти",0,{"$nulls":6},0,""]
[640,null,{"v":5219,"d":"52-19"},"придобиване на други ДМА",0,{"$nulls":6},0,""]
[645,{"v":5300,"d":"53-00"},"Придобиване на нематериални дълготрайни активи",null,{"$f":"SUM(E727:E728)","v":0},0,0,{"$f":"SUM(H727:H728)","v":0},0,0,0,0,""]
[650,null,{"v":5301,"d":"53-01"},"придобиване на програмни продукти и лицензи за програмни продукти",{"$f":"F727+G727+H727","v":0},{"$nulls":6},{"$f":"I727+J727+K727","v":0},""]
[655,null,{"v":5309,"d":"53-09"},"придобиване на други нематериални дълготрайни активи",{"$f":"F728+G728+H728","v":0},{"$nulls":6},{"$f":"I728+J728+K728","v":0},""]
[665,{"v":5400,"d":"54-00"},"Придобиване на земя",null,{"$f":"F729+G729+H729","v":0},{"$nulls":6},{"$f":"I729+J729+K729","v":0},""]
[675,{"v":5500,"d":"55-00"},"Капиталови трансфери",null,{"$f":"SUM(E731:E734)","v":0},0,0,{"$f":"SUM(H731:H734)","v":0},0,0,0,0,""]
[685,null,{"v":5501,"d":"55-01"},"капиталови трансфери за нефинансови предприятия",{"$f":"F731+G731+H731","v":0},{"$nulls":6},{"$f":"I731+J731+K731","v":0},""]
[690,null,{"v":5502,"d":"55-02"},"капиталови трансфери за финансови институции",{"$f":"F732+G732+H732","v":0},{"$nulls":6},{"$f":"I732+J732+K732","v":0},""]
[695,null,{"v":5503,"d":"55-03"},"капиталови трансфери за организации с нестопанска цел",{"$f":"F733+G733+H733","v":0},{"$nulls":6},{"$f":"I733+J733+K733","v":0},""]
[700,null,{"v":5504,"d":"55-04"},"капиталови трансфери за домакинствата",{"$f":"F734+G734+H734","v":0},{"$nulls":6},{"$f":"I734+J734+K734","v":0},""]
[710,{"v":5700,"d":"57-00"},"Прираст на държавния резерв и изкупуване на земеделска продукция (включва и § 40-71)",null,{"$f":"SUM(E736:E738)","v":0},0,0,0,0,0,0,{"$f":"SUM(L736:L738)","v":0},""]
[715,null,{"v":5701,"d":"57-01"},"плащания за попълване на държавния резерв",{"$f":"F736+G736+H736","v":0},0,0,0,0,0,0,{"$f":"I736+J736+K736","v":0},""]
[720,null,{"v":5702,"d":"57-02"},"плащания за изкупуване на земеделска продукция",{"$f":"F737+G737+H737","v":0},0,0,0,0,0,0,{"$f":"I737+J737+K737","v":0},""]
[725,null,{"v":4071,"d":"40-71"},"постъпления от продажба на държавния резерв (-)",{"$f":"F738+G738+H738","v":0},0,0,0,0,0,0,{"$f":"I738+J738+K738","v":0},""]
[730,null,"Резерв за непредвидени и неотложни разходи",{"$nulls":9},""]
[735,{"v":98,"d":"00-98"},"Резерв за непредвидени и неотложни разходи",null,{"$f":"F740+G740+H740","v":0},{"$nulls":3},0,0,0,{"$f":"I740+J740+K740","v":0},""]
[740,{"$nulls":11},""]
[745,{"$nulls":11},""]
[750,{"$nulls":11},""]
[755,null,"99-99",{"$f":"+B744","v":{"v":0,"d":"II. ОБЩО РАЗХОДИ ЗА ДЕЙНОСТ 0000"}},{"$f":"SUM(E629,E632,E638,E646,E647,E665,E669,E675,E678,E679,E680,E681,E682,E691,E697,E698,E699,E700,E707,E711,E712,E713,E714,E717,E718,E726,E729,E730,E735)+E740","v":{"v":16504,"d":"16,504"}},{"v":16504,"d":"16,504"},0,0,{"v":16504,"d":"16,504"},0,0,{"v":16504,"d":"16,504"},{"$f":"(IF($E744<>0,$M$2,IF($L744<>0,$M$2,\"\")))","v":1},{"$f":"LEFT(C626,1)","v":"3"}]
[760,"край на дейност",{"$nulls":10},{"$f":"(IF($E744<>0,$M$2,IF($L744<>0,$M$2,\"\")))","v":1}]
[765,{"$nulls":11},{"$f":"(IF($E744<>0,$M$2,IF($L744<>0,$M$2,\"\")))","v":1}]
[775,{"$nulls":11},{"$f":"(IF(E742<>0,$G$2,IF(L742<>0,$G$2,\"\")))","v":""}]
[780,{"$nulls":11},{"$f":"(IF($E881<>0,$M$2,IF($L881<>0,$M$2,\"\")))","v":""}]
[785,{"$nulls":11},{"$f":"(IF($E881<>0,$M$2,IF($L881<>0,$M$2,\"\")))","v":""}]
[790,{"$f":"$B$7","v":"ОТЧЕТНИ ДАННИ ПО ЕБК ЗА СМЕТКИТЕ ЗА СРЕДСТВАТА ОТ ЕВРОПЕЙСКИЯ СЪЮЗ - КСФ"},{"$nulls":10},{"$f":"(IF($E881<>0,$M$2,IF($L881<>0,$M$2,\"\")))","v":""}]
[795,{"$nulls":3},"за периода от ","до",null,"        II.1. РАЗХОДИ ПО ДЕЙНОСТИ",{"$nulls":4},{"$f":"(IF($E881<>0,$M$2,IF($L881<>0,$M$2,\"\")))","v":""}]
[805,{"$f":"$B$9","v":"ДЕТСКА ГРАДИНА \"НАРЦИС\""},null,null,{"$f":"$E$9","v":"2020-01-01"},{"$f":"$F$9","v":"2020-06-30"},{"$nulls":6},{"$f":"(IF($E881<>0,$M$2,IF($L881<>0,$M$2,\"\")))","v":""}]
[810,{"$f":"$B$10","v":"(наименование на разпоредителя с бюджет)"},{"$nulls":10},{"$f":"(IF($E881<>0,$M$2,IF($L881<>0,$M$2,\"\")))","v":""}]
[815,{"$nulls":11},{"$f":"(IF($E881<>0,$M$2,IF($L881<>0,$M$2,\"\")))","v":""}]
[525,{"$f":"$B$12","v":"Силистра"},null,null,"       код по ЕБК:",{"$f":"$F$12","v":"6905"},{"$nulls":6},{"$f":"(IF($E881<>0,$M$2,IF($L881<>0,$M$2,\"\")))","v":""}]
[820,{"$f":"$B$13","v":"(наименование на първостепенния разпоредител с бюджет)"},{"$nulls":10},{"$f":"(IF($E881<>0,$M$2,IF($L881<>0,$M$2,\"\")))","v":""}]
[821,null,null,"ФИНАНСОВО-ПРАВНА ФОРМА",{"$f":"$E$15","v":98},{"$f":"$F$15","v":"СЕС - КСФ"},{"$nulls":6},{"$f":"(IF($E881<>0,$M$2,IF($L881<>0,$M$2,\"\")))","v":""}]
[822,{"$nulls":10},"(в лева)",{"$f":"(IF($E881<>0,$M$2,IF($L881<>0,$M$2,\"\")))","v":""}]
[823,null,null,"II.1. РАЗХОДИ ПО ДЕЙНОСТИ","Уточнен план 2020",{"$nulls":3},"Отчет 2020",{"$nulls":3},{"$f":"(IF($E881<>0,$M$2,IF($L881<>0,$M$2,\"\")))","v":""}]
[825,"§§","под-§§","НАИМЕНОВАНИЯ НА ПАРАГРАФИТЕ И ПОДПАРАГРАФИТЕ",{"$f":"$E$20","v":"Уточнен план                Общо"},{"$f":"$F$20","v":"държавни дейности"},{"$f":"$G$20","v":"местни дейности"},{"$f":"$H$20","v":"дофинансиране"},{"$f":"$I$20","v":"държавни дейности -ОТЧЕТ"},{"$f":"$J$20","v":"местни дейности - ОТЧЕТ"},{"$f":"$K$20","v":"дофинансиране - ОТЧЕТ"},{"$f":"$L$20","v":"ОТЧЕТ                                    ОБЩО"},{"$f":"(IF($E881<>0,$M$2,IF($L881<>0,$M$2,\"\")))","v":""}]
[{"$nulls":3}," 02 ¦",{"$f":"$E$21","v":"(1)"},{"$f":"$F$21","v":"(2)"},{"$f":"$G$21","v":"(3)"},{"$f":"$H$21","v":"(4)"},{"$f":"$I$21","v":"(5)"},{"$f":"$J$21","v":"(6)"},{"$f":"$K$21","v":"(7)"},{"$f":"$L$21","v":"(8)"},{"$f":"(IF($E881<>0,$M$2,IF($L881<>0,$M$2,\"\")))","v":""}]
[null,null,{"$f":"VLOOKUP(D762,OP_LIST2,2,FALSE)","v":0},"ИЗБЕРЕТЕ ОПЕРАТИВНА ПРОГРАМА ",{"$nulls":8},{"$f":"(IF($E881<>0,$M$2,IF($L881<>0,$M$2,\"\")))","v":""}]
[null,null,{"$f":"VLOOKUP(D764,EBK_DEIN2,2,FALSE)","v":3311},"<------          ДЕЙНОСТ    -  код  по  ЕБК",{"$nulls":8},{"$f":"(IF($E881<>0,$M$2,IF($L881<>0,$M$2,\"\")))","v":""}]
[null,null,{"$f":"+C763","v":3311},"311 Детски градини",{"$nulls":8},{"$f":"(IF($E881<>0,$M$2,IF($L881<>0,$M$2,\"\")))","v":""}]
[{"$nulls":3},"(наименование на дейността)",{"$nulls":8},{"$f":"(IF($E881<>0,$M$2,IF($L881<>0,$M$2,\"\")))","v":""}]
[null,{"v":100,"d":"01-00"},"Заплати и възнаграждения за персонала, нает по трудови и служебни правоотношения",null,{"$f":"SUM(E767:E768)","v":0},0,0,{"$f":"SUM(H767:H768)","v":0},0,0,0,0,{"$f":"(IF($E766<>0,$M$2,IF($L766<>0,$M$2,\"\")))","v":""}]
[null,null,{"v":101,"d":"01-01"},"заплати и възнаграждения на персонала нает по трудови правоотношения",{"$f":"F767+G767+H767","v":0},{"$nulls":6},{"$f":"I767+J767+K767","v":0},{"$f":"(IF($E767<>0,$M$2,IF($L767<>0,$M$2,\"\")))","v":""}]
[null,null,{"v":102,"d":"01-02"},"заплати и възнаграждения на персонала нает по служебни правоотношения",{"$f":"F768+G768+H768","v":0},{"$nulls":6},{"$f":"I768+J768+K768","v":0},""]
[null,{"v":200,"d":"02-00"},"Други възнаграждения и плащания за персонала",null,{"$f":"SUM(E770:E774)","v":0},0,0,{"$f":"SUM(H770:H774)","v":0},0,0,0,0,""]
[null,null,{"v":201,"d":"02-01"},"за нещатен персонал нает по трудови правоотношения ",{"$f":"F770+G770+H770","v":0},{"$nulls":6},{"$f":"I770+J770+K770","v":0},""]
[null,null,{"v":202,"d":"02-02"},"за персонала по извънтрудови правоотношения",{"$f":"F771+G771+H771","v":0},{"$nulls":6},{"$f":"I771+J771+K771","v":0},""]
[null,null,{"v":205,"d":"02-05"},"изплатени суми от СБКО за облекло и други на персонала, с характер на възнаграждение",{"$f":"F772+G772+H772","v":0},{"$nulls":6},{"$f":"I772+J772+K772","v":0},""]
[null,null,{"v":208,"d":"02-08"},"обезщетения за персонала, с характер на възнаграждение",{"$f":"F773+G773+H773","v":0},{"$nulls":6},{"$f":"I773+J773+K773","v":0},""]
[null,null,{"v":209,"d":"02-09"},"другиплащания и възнаграждения",{"$f":"F774+G774+H774","v":0},{"$nulls":6},{"$f":"I774+J774+K774","v":0},""]
[null,{"v":500,"d":"05-00"},"Задължителни осигурителни вноски от работодатели",null,{"$f":"SUM(E776:E782)","v":0},0,0,{"$f":"SUM(H776:H782)","v":0},0,0,0,0,""]
[null,null,{"v":551,"d":"05-51"},"осигурителни вноски от работодатели за Държавното обществено осигуряване (ДОО)",{"$f":"F776+G776+H776","v":0},{"$nulls":6},{"$f":"I776+J776+K776","v":0},""]
[null,null,{"v":552,"d":"05-52"},"осигурителни вноски от работодатели за Учителския пенсионен фонд (УчПФ)",0,{"$nulls":6},0,""]
[null,null,{"v":558,"d":"05-58"},"вноски по чл. 4б и 4в от КСО за сметка на осигурителя",{"$f":"F778+G778+H778","v":0},0,0,0,0,0,0,{"$f":"I778+J778+K778","v":0},""]
[null,null,{"v":560,"d":"05-60"},"здравно-осигурителни вноски от работодатели",0,{"$nulls":6},0,""]
[null,null,{"v":580,"d":"05-80"},"вноски за допълнително задължително осигуряване от работодатели",0,{"$nulls":6},0,""]
[null,null,{"v":588,"d":"05-88"},"коректив на вноски за ДЗПО за сумите по чл. 4б и 4в от КСО за сметка на осигурителя",{"$f":"F781+G781+H781","v":0},0,0,0,0,0,0,{"$f":"I781+J781+K781","v":0},""]
[null,null,{"v":590,"d":"05-90"},"задължителни вноски за чуждестранни пенсионни фондове и  схеми за сметка на осигурителя",0,{"$nulls":6},0,""]
[5,{"v":800,"d":"08-00"},"Вноски за доброволно осигуряване  ",null,0,{"$nulls":6},0,""]
[10,{"v":1000,"d":"10-00"},"Издръжка",null,{"$f":"SUM(E785:E801)","v":0},0,0,{"$f":"SUM(H785:H801)","v":0},0,0,0,0,""]
[15,null,{"v":1011,"d":"10-11"},"Храна",{"$f":"F785+G785+H785","v":0},{"$nulls":6},{"$f":"I785+J785+K785","v":0},""]
[35,null,{"v":1012,"d":"10-12"},"Медикаменти",0,{"$nulls":6},0,""]
[40,null,{"v":1013,"d":"10-13"},"Постелен инвентар и облекло",0,{"$nulls":6},0,""]
[45,null,{"v":1014,"d":"10-14"},"Учебни и научно-изследователски разходи и книги за библиотеките",0,{"$nulls":6},0,""]
[50,null,{"v":1015,"d":"10-15"},"материали",0,{"$nulls":6},0,""]
[55,null,{"v":1016,"d":"10-16"},"вода, горива и енергия",0,{"$nulls":6},0,""]
[60,null,{"v":1020,"d":"10-20"},"разходи за външни услуги",0,{"$nulls":6},0,""]
[65,null,{"v":1030,"d":"10-30"},"Текущ ремонт",0,{"$nulls":6},0,""]
[70,null,{"v":1051,"d":"10-51"},"командировки в страната",0,{"$nulls":6},0,""]
[75,null,{"v":1052,"d":"10-52"},"краткосрочни командировки в чужбина",0,{"$nulls":6},0,""]
[80,null,{"v":1053,"d":"10-53"},"дългосрочни командировки в чужбина",0,{"$nulls":6},0,""]
[80,null,{"v":1062,"d":"10-62"},"разходи за застраховки",0,{"$nulls":6},0,""]
[85,null,{"v":1063,"d":"10-63"},"такса ангажимент по заеми",0,{"$nulls":6},0,""]
[90,null,{"v":1069,"d":"10-69"},"други финансови услуги",0,{"$nulls":6},0,""]
[90,null,{"v":1091,"d":"10-91"},"други разходи за СБКО",0,{"$nulls":6},0,""]
[115,null,{"v":1092,"d":"10-92"},"разходи за договорни санкции и неустойки, съдебни обезщетения и разноски",0,{"$nulls":6},0,""]
[125,null,{"v":1098,"d":"10-98"},"други разходи, некласифицирани в другите параграфи и подпараграфи",0,{"$nulls":6},0,""]
[130,{"v":1900,"d":"19-00"},"Платени данъци, такси и административни санкции",null,{"$f":"SUM(E803:E805)","v":0},0,0,{"$f":"SUM(H803:H805)","v":0},0,0,0,0,""]
[135,null,{"v":1901,"d":"19-01"},"платени държавни данъци, такси, наказателни лихви и административни санкции",{"$f":"F803+G803+H803","v":0},{"$nulls":6},{"$f":"I803+J803+K803","v":0},""]
[140,null,{"v":1981,"d":"19-81"},"платени общински данъци, такси, наказателни лихви и административни санкции",{"$f":"F804+G804+H804","v":0},{"$nulls":6},{"$f":"I804+J804+K804","v":0},""]
[145,null,{"v":1991,"d":"19-91"},"платени данъци, такси, наказателни лихви и административни санкции в чужбина",{"$f":"F805+G805+H805","v":0},{"$nulls":6},{"$f":"I805+J805+K805","v":0},""]
[150,{"v":2100,"d":"21-00"},"Разходи за лихви по емисии на държавни (общински) ценни книжа",null,{"$f":"SUM(E807:E811)","v":0},0,0,{"$f":"SUM(H807:H811)","v":0},0,0,0,0,""]
[155,null,{"v":2110,"d":"21-10"},"лихви по държавни (общински) ценни книжа",{"$f":"F807+G807+H807","v":0},{"$nulls":6},{"$f":"I807+J807+K807","v":0},""]
[160,null,{"v":2120,"d":"21-20"},"отстъпки по държавни (общински) ценни книжа",{"$f":"F808+G808+H808","v":0},{"$nulls":6},{"$f":"I808+J808+K808","v":0},""]
[165,null,{"v":2125,"d":"21-25"},"лихви и отстъпки по целеви емисии на държавни ценни книжа",{"$f":"F809+G809+H809","v":0},0,0,0,0,0,0,{"$f":"I809+J809+K809","v":0},""]
[175,null,{"v":2140,"d":"21-40"},"лихви по държавни ценни книжа, емитирани за структурната реформа ",{"$f":"F810+G810+H810","v":0},0,0,0,0,0,0,{"$f":"I810+J810+K810","v":0},""]
[180,null,{"v":2190,"d":"21-90"},"премии над номинала от емисии на държавни (общински) ценни книжа (-)",{"$f":"F811+G811+H811","v":0},{"$nulls":6},{"$f":"I811+J811+K811","v":0},""]
[185,{"v":2200,"d":"22-00"},"Разходи за лихви по заеми от страната",null,{"$f":"SUM(E813:E814)","v":0},0,0,{"$f":"SUM(H813:H814)","v":0},0,0,0,0,""]
[190,null,{"v":2221,"d":"22-21"},"Разходи за лихви по заеми от банки в страната",{"$f":"F813+G813+H813","v":0},{"$nulls":6},{"$f":"I813+J813+K813","v":0},""]
[200,null,{"v":2224,"d":"22-24"},"Разходи за лихви по други заеми от страната",0,{"$nulls":6},0,""]
[200,{"v":2500,"d":"25-00"},"Разходи за лихви по заеми от други държави",null,0,{"$nulls":6},0,""]
[205,{"v":2600,"d":"26-00"},"Разходи за лихви по заеми от международни организации и институции",null,0,{"$nulls":6},0,""]
[210,{"v":2700,"d":"27-00"},"Разходи за лихви по заеми от банки и други финансови институции от чужбина",null,0,{"$nulls":6},0,""]
[215,{"v":2800,"d":"28-00"},"Разходи за лихви и отстъпки по облигации, емитирани и търгувани на международните капиталови пазари",null,0,{"$nulls":6},0,""]
[220,{"v":2900,"d":"29-00"},"Други разходи за лихви",null,{"$f":"SUM(E820:E827)","v":0},{"$f":"SUM(F820:F827)","v":0},{"$f":"SUM(G820:G827)","v":0},0,0,0,0,0,""]
[225,null,{"v":2910,"d":"29-10"},"Платени лихви по финансов лизинг и търговски кредит",{"$f":"F820+G820+H820","v":0},{"$nulls":6},{"$f":"I820+J820+K820","v":0},""]
[230,null,{"v":2920,"d":"29-20"},"Платени лихви по активирани гаранции по заеми от  банки в страната",{"$f":"F821+G821+H821","v":0},{"$nulls":6},{"$f":"I821+J821+K821","v":0},""]
[245,null,{"v":2969,"d":"29-69"},"Платени лихви по активирани гаранции по заеми от международни организации и институции",0,{"$nulls":6},0,""]
[220,null,{"v":2970,"d":"29-70"},"Платени лихви по активирани гаранции по заеми от банки и финансови институции от чужбина",0,{"$nulls":6},0,""]
[225,null,{"v":2989,"d":"29-89"},"Възстановени суми по платени лихви по активирани гаранции (-)",0,{"$nulls":6},0,""]
[230,null,{"v":2990,"d":"29-90"},"Платени лихви по активирани гаранции по заеми от  банки в страната",{"$f":"F825+G825+H825","v":0},{"$nulls":6},{"$f":"I825+J825+K825","v":0},""]
[235,null,{"v":2991,"d":"29-91"},"Други разходи за лихви към  местни лица",0,{"$nulls":6},0,""]
[240,null,{"v":2992,"d":"29-92"},"Други разходи за лихви към чуждестранни лица",0,{"$nulls":6},0,""]
[245,{"v":3300,"d":"33-00"},"Вноска в общия бюджет на Европейския съюз",null,{"$f":"SUM(E829:E833)","v":0},0,0,0,0,0,0,0,""]
[250,null,{"v":3301,"d":"33-01"},"ресурс на база брутен национален доход",{"$f":"F829+G829+H829","v":0},0,0,0,0,0,0,{"$f":"I829+J829+K829","v":0},""]
[255,null,{"v":3302,"d":"33-02"},"ресурс на база данък върху добавената стойност",0,0,0,0,0,0,0,0,""]
[265,null,{"v":3303,"d":"33-03"},"корекция за Обединеното кралство",0,0,0,0,0,0,0,0,""]
[270,null,{"v":3304,"d":"33-04"},"традиционни собствени ресурси - мита",0,0,0,0,0,0,0,0,""]
[290,null,{"v":3306,"d":"33-06"},"участие във финансирането на брутното намаление за Нидерландия, Швеция, Дания и Австрия",0,0,0,0,0,0,0,0,""]
[320,{"v":3900,"d":"39-00"},"Здравно-осигурителни плащания",null,0,0,0,0,0,0,0,0,{"$f":"(IF($E834<>0,$M$2,IF($L834<>0,$M$2,\"\")))","v":""}]
[330,{"v":4000,"d":"40-00"},"Стипендии",null,0,{"$nulls":6},0,""]
[350,{"v":4100,"d":"41-00"},"Пенсии",null,0,0,0,0,0,0,0,0,""]
[355,{"v":4200,"d":"42-00"},"Текущи трансфери, обезщетения и помощи за домакинствата",null,{"$f":"SUM(E838:E843)","v":0},0,0,{"$f":"SUM(H838:H843)","v":0},0,0,0,0,""]
[355,null,{"v":4201,"d":"42-01"},"обезщетения и помощи по социалното осигуряване",{"$f":"F838+G838+H838","v":0},{"$nulls":6},{"$f":"I838+J838+K838","v":0},""]
[375,null,{"v":4202,"d":"42-02"},"обезщетения и помощи по социалното подпомагане",0,{"$nulls":6},0,""]
[380,null,{"v":4214,"d":"42-14"},"обезщетения и помощи по решение на общинския съвет",0,{"$nulls":6},0,""]
[385,null,{"v":4217,"d":"42-17"},"текущи трансфери за домакинства от средства на Европейския съюз",0,{"$nulls":6},0,""]
[390,null,{"v":4218,"d":"42-18"},"текущи трансфери за домакинства по други международни програми и споразумения",0,{"$nulls":6},0,""]
[390,null,{"v":4219,"d":"42-19"},"други текущи трансфери за домакинствата",0,{"$nulls":6},0,""]
[395,{"v":4300,"d":"43-00"},"Субсидии и други текущи трансфери за нефинансови предприятия",null,{"$f":"SUM(E845:E847)","v":0},0,0,{"$f":"SUM(H845:H847)","v":0},0,0,0,0,""]
[397,null,{"v":4301,"d":"43-01"},"за текуща дейност",{"$f":"F845+G845+H845","v":0},{"$nulls":6},{"$f":"I845+J845+K845","v":0},""]
[398,null,{"v":4302,"d":"43-02"},"за осъществяване на болнична помощ ",0,{"$nulls":6},0,""]
[399,null,{"v":4309,"d":"43-09"},"други субсидии и плащания",0,{"$nulls":6},0,""]
[400,{"v":4400,"d":"44-00"},"Субсидии и други текущи трансфери за финансови институции",null,0,{"$nulls":6},0,""]
[401,{"v":4500,"d":"45-00"},"Субсидии и други текущи трансфери за юридически лица с нестопанска цел",null,0,{"$nulls":6},0,""]
[404,{"v":4600,"d":"46-00"},"Разходи за членски внос и участие в нетърговски организации и дейности",null,0,{"$nulls":6},0,""]
[404,{"v":4900,"d":"49-00"},"Предоставени текущи и капиталови трансфери за чужбина",null,{"$f":"+E852+E853","v":0},0,0,{"$f":"+H852+H853","v":0},0,0,0,0,""]
[440,null,{"v":4901,"d":"49-01"},"текущи трансфери за чужбина",{"$f":"F852+G852+H852","v":0},{"$nulls":6},{"$f":"I852+J852+K852","v":0},""]
[450,null,{"v":4902,"d":"49-02"},"капиталови трансфери за чужбина",{"$f":"F853+G853+H853","v":0},{"$nulls":6},{"$f":"I853+J853+K853","v":0},""]
[495,{"v":5100,"d":"51-00"},"Основен ремонт на дълготрайни материални активи",null,{"$f":"F854+G854+H854","v":0},{"$nulls":6},{"$f":"I854+J854+K854","v":0},""]
[500,{"v":5200,"d":"52-00"},"Придобиване на дълготрайни материални активи",null,{"$f":"SUM(E856:E862)","v":0},0,0,{"$f":"SUM(H856:H862)","v":0},0,0,0,0,""]
[505,null,{"v":5201,"d":"52-01"},"придобиване на компютри и хардуер",{"$f":"F856+G856+H856","v":0},{"$nulls":6},{"$f":"I856+J856+K856","v":0},""]
[510,null,{"v":5202,"d":"52-02"},"придобиване на сгради",0,{"$nulls":6},0,""]
[515,null,{"v":5203,"d":"52-03"},"придобиване на друго оборудване, машини и съоръжения",0,{"$nulls":6},0,""]
[520,null,{"v":5204,"d":"52-04"},"придобиване на транспортни средства",0,{"$nulls":6},0,""]
[525,null,{"v":5205,"d":"52-05"},"придобиване на стопански инвентар",0,{"$nulls":6},0,""]
[635,null,{"v":5206,"d":"52-06"},"изграждане на инфраструктурни обекти",0,{"$nulls":6},0,""]
[640,null,{"v":5219,"d":"52-19"},"придобиване на други ДМА",0,{"$nulls":6},0,""]
[645,{"v":5300,"d":"53-00"},"Придобиване на нематериални дълготрайни активи",null,{"$f":"SUM(E864:E865)","v":0},0,0,{"$f":"SUM(H864:H865)","v":0},0,0,0,0,""]
[650,null,{"v":5301,"d":"53-01"},"придобиване на програмни продукти и лицензи за програмни продукти",{"$f":"F864+G864+H864","v":0},{"$nulls":6},{"$f":"I864+J864+K864","v":0},""]
[655,null,{"v":5309,"d":"53-09"},"придобиване на други нематериални дълготрайни активи",{"$f":"F865+G865+H865","v":0},{"$nulls":6},{"$f":"I865+J865+K865","v":0},""]
[665,{"v":5400,"d":"54-00"},"Придобиване на земя",null,{"$f":"F866+G866+H866","v":0},{"$nulls":6},{"$f":"I866+J866+K866","v":0},""]
[675,{"v":5500,"d":"55-00"},"Капиталови трансфери",null,{"$f":"SUM(E868:E871)","v":0},0,0,{"$f":"SUM(H868:H871)","v":0},0,0,0,0,""]
[685,null,{"v":5501,"d":"55-01"},"капиталови трансфери за нефинансови предприятия",{"$f":"F868+G868+H868","v":0},{"$nulls":6},{"$f":"I868+J868+K868","v":0},""]
[690,null,{"v":5502,"d":"55-02"},"капиталови трансфери за финансови институции",{"$f":"F869+G869+H869","v":0},{"$nulls":6},{"$f":"I869+J869+K869","v":0},""]
[695,null,{"v":5503,"d":"55-03"},"капиталови трансфери за организации с нестопанска цел",{"$f":"F870+G870+H870","v":0},{"$nulls":6},{"$f":"I870+J870+K870","v":0},""]
[700,null,{"v":5504,"d":"55-04"},"капиталови трансфери за домакинствата",{"$f":"F871+G871+H871","v":0},{"$nulls":6},{"$f":"I871+J871+K871","v":0},""]
[710,{"v":5700,"d":"57-00"},"Прираст на държавния резерв и изкупуване на земеделска продукция (включва и § 40-71)",null,{"$f":"SUM(E873:E875)","v":0},0,0,0,0,0,0,{"$f":"SUM(L873:L875)","v":0},""]
[715,null,{"v":5701,"d":"57-01"},"плащания за попълване на държавния резерв",{"$f":"F873+G873+H873","v":0},0,0,0,0,0,0,{"$f":"I873+J873+K873","v":0},""]
[720,null,{"v":5702,"d":"57-02"},"плащания за изкупуване на земеделска продукция",{"$f":"F874+G874+H874","v":0},0,0,0,0,0,0,{"$f":"I874+J874+K874","v":0},""]
[725,null,{"v":4071,"d":"40-71"},"постъпления от продажба на държавния резерв (-)",{"$f":"F875+G875+H875","v":0},0,0,0,0,0,0,{"$f":"I875+J875+K875","v":0},""]
[730,null,"Резерв за непредвидени и неотложни разходи",{"$nulls":9},""]
[735,{"v":98,"d":"00-98"},"Резерв за непредвидени и неотложни разходи",null,{"$f":"F877+G877+H877","v":0},{"$nulls":3},0,0,0,{"$f":"I877+J877+K877","v":0},""]
[740,{"$nulls":11},""]
[745,{"$nulls":11},""]
[750,{"$nulls":11},""]
[755,null,"99-99",{"$f":"+B881","v":{"v":0,"d":"II. ОБЩО РАЗХОДИ ЗА ДЕЙНОСТ 0000"}},{"$f":"SUM(E766,E769,E775,E783,E784,E802,E806,E812,E815,E816,E817,E818,E819,E828,E834,E835,E836,E837,E844,E848,E849,E850,E851,E854,E855,E863,E866,E867,E872)+E877","v":0},0,0,0,0,0,0,0,{"$f":"(IF($E881<>0,$M$2,IF($L881<>0,$M$2,\"\")))","v":""},{"$f":"LEFT(C763,1)","v":"3"}]
[760,"край на дейност",{"$nulls":10},{"$f":"(IF($E881<>0,$M$2,IF($L881<>0,$M$2,\"\")))","v":""}]
[765,{"$nulls":11},{"$f":"(IF($E881<>0,$M$2,IF($L881<>0,$M$2,\"\")))","v":""}]
[775,{"$nulls":11},{"$f":"(IF(E879<>0,$G$2,IF(L879<>0,$G$2,\"\")))","v":""}]
[780,{"$nulls":11},{"$f":"(IF($E1018<>0,$M$2,IF($L1018<>0,$M$2,\"\")))","v":""}]
[785,{"$nulls":11},{"$f":"(IF($E1018<>0,$M$2,IF($L1018<>0,$M$2,\"\")))","v":""}]
[790,{"$f":"$B$7","v":"ОТЧЕТНИ ДАННИ ПО ЕБК ЗА СМЕТКИТЕ ЗА СРЕДСТВАТА ОТ ЕВРОПЕЙСКИЯ СЪЮЗ - КСФ"},{"$nulls":10},{"$f":"(IF($E1018<>0,$M$2,IF($L1018<>0,$M$2,\"\")))","v":""}]
[795,{"$nulls":3},"за периода от ","до",null,"        II.1. РАЗХОДИ ПО ДЕЙНОСТИ",{"$nulls":4},{"$f":"(IF($E1018<>0,$M$2,IF($L1018<>0,$M$2,\"\")))","v":""}]
[805,{"$f":"$B$9","v":"ДЕТСКА ГРАДИНА \"НАРЦИС\""},null,null,{"$f":"$E$9","v":"2020-01-01"},{"$f":"$F$9","v":"2020-06-30"},{"$nulls":6},{"$f":"(IF($E1018<>0,$M$2,IF($L1018<>0,$M$2,\"\")))","v":""}]
[810,{"$f":"$B$10","v":"(наименование на разпоредителя с бюджет)"},{"$nulls":10},{"$f":"(IF($E1018<>0,$M$2,IF($L1018<>0,$M$2,\"\")))","v":""}]
[815,{"$nulls":11},{"$f":"(IF($E1018<>0,$M$2,IF($L1018<>0,$M$2,\"\")))","v":""}]
[525,{"$f":"$B$12","v":"Силистра"},null,null,"       код по ЕБК:",{"$f":"$F$12","v":"6905"},{"$nulls":6},{"$f":"(IF($E1018<>0,$M$2,IF($L1018<>0,$M$2,\"\")))","v":""}]
[820,{"$f":"$B$13","v":"(наименование на първостепенния разпоредител с бюджет)"},{"$nulls":10},{"$f":"(IF($E1018<>0,$M$2,IF($L1018<>0,$M$2,\"\")))","v":""}]
[821,null,null,"ФИНАНСОВО-ПРАВНА ФОРМА",{"$f":"$E$15","v":98},{"$f":"$F$15","v":"СЕС - КСФ"},{"$nulls":6},{"$f":"(IF($E1018<>0,$M$2,IF($L1018<>0,$M$2,\"\")))","v":""}]
[822,{"$nulls":10},"(в лева)",{"$f":"(IF($E1018<>0,$M$2,IF($L1018<>0,$M$2,\"\")))","v":""}]
[823,null,null,"II.1. РАЗХОДИ ПО ДЕЙНОСТИ","Уточнен план 2020",{"$nulls":3},"Отчет 2020",{"$nulls":3},{"$f":"(IF($E1018<>0,$M$2,IF($L1018<>0,$M$2,\"\")))","v":""}]
[825,"§§","под-§§","НАИМЕНОВАНИЯ НА ПАРАГРАФИТЕ И ПОДПАРАГРАФИТЕ",{"$f":"$E$20","v":"Уточнен план                Общо"},{"$f":"$F$20","v":"държавни дейности"},{"$f":"$G$20","v":"местни дейности"},{"$f":"$H$20","v":"дофинансиране"},{"$f":"$I$20","v":"държавни дейности -ОТЧЕТ"},{"$f":"$J$20","v":"местни дейности - ОТЧЕТ"},{"$f":"$K$20","v":"дофинансиране - ОТЧЕТ"},{"$f":"$L$20","v":"ОТЧЕТ                                    ОБЩО"},{"$f":"(IF($E1018<>0,$M$2,IF($L1018<>0,$M$2,\"\")))","v":""}]
[{"$nulls":3}," 02 ¦",{"$f":"$E$21","v":"(1)"},{"$f":"$F$21","v":"(2)"},{"$f":"$G$21","v":"(3)"},{"$f":"$H$21","v":"(4)"},{"$f":"$I$21","v":"(5)"},{"$f":"$J$21","v":"(6)"},{"$f":"$K$21","v":"(7)"},{"$f":"$L$21","v":"(8)"},{"$f":"(IF($E1018<>0,$M$2,IF($L1018<>0,$M$2,\"\")))","v":""}]
[null,null,{"$f":"VLOOKUP(D899,OP_LIST2,2,FALSE)","v":0},"ИЗБЕРЕТЕ ОПЕРАТИВНА ПРОГРАМА ",{"$nulls":8},{"$f":"(IF($E1018<>0,$M$2,IF($L1018<>0,$M$2,\"\")))","v":""}]
[null,null,{"$f":"VLOOKUP(D901,EBK_DEIN2,2,FALSE)","v":3311},"<------          ДЕЙНОСТ    -  код  по  ЕБК",{"$nulls":8},{"$f":"(IF($E1018<>0,$M$2,IF($L1018<>0,$M$2,\"\")))","v":""}]
[null,null,{"$f":"+C900","v":3311},"311 Детски градини",{"$nulls":8},{"$f":"(IF($E1018<>0,$M$2,IF($L1018<>0,$M$2,\"\")))","v":""}]
[{"$nulls":3},"(наименование на дейността)",{"$nulls":8},{"$f":"(IF($E1018<>0,$M$2,IF($L1018<>0,$M$2,\"\")))","v":""}]
[null,{"v":100,"d":"01-00"},"Заплати и възнаграждения за персонала, нает по трудови и служебни правоотношения",null,{"$f":"SUM(E904:E905)","v":0},0,0,{"$f":"SUM(H904:H905)","v":0},0,0,0,0,{"$f":"(IF($E903<>0,$M$2,IF($L903<>0,$M$2,\"\")))","v":""}]
[null,null,{"v":101,"d":"01-01"},"заплати и възнаграждения на персонала нает по трудови правоотношения",{"$f":"F904+G904+H904","v":0},{"$nulls":6},{"$f":"I904+J904+K904","v":0},{"$f":"(IF($E904<>0,$M$2,IF($L904<>0,$M$2,\"\")))","v":""}]
[null,null,{"v":102,"d":"01-02"},"заплати и възнаграждения на персонала нает по служебни правоотношения",{"$f":"F905+G905+H905","v":0},{"$nulls":6},{"$f":"I905+J905+K905","v":0},""]
[null,{"v":200,"d":"02-00"},"Други възнаграждения и плащания за персонала",null,{"$f":"SUM(E907:E911)","v":0},0,0,{"$f":"SUM(H907:H911)","v":0},0,0,0,0,""]
[null,null,{"v":201,"d":"02-01"},"за нещатен персонал нает по трудови правоотношения ",{"$f":"F907+G907+H907","v":0},{"$nulls":6},{"$f":"I907+J907+K907","v":0},""]
[null,null,{"v":202,"d":"02-02"},"за персонала по извънтрудови правоотношения",{"$f":"F908+G908+H908","v":0},{"$nulls":6},{"$f":"I908+J908+K908","v":0},""]
[null,null,{"v":205,"d":"02-05"},"изплатени суми от СБКО за облекло и други на персонала, с характер на възнаграждение",{"$f":"F909+G909+H909","v":0},{"$nulls":6},{"$f":"I909+J909+K909","v":0},""]
[null,null,{"v":208,"d":"02-08"},"обезщетения за персонала, с характер на възнаграждение",{"$f":"F910+G910+H910","v":0},{"$nulls":6},{"$f":"I910+J910+K910","v":0},""]
[null,null,{"v":209,"d":"02-09"},"другиплащания и възнаграждения",{"$f":"F911+G911+H911","v":0},{"$nulls":6},{"$f":"I911+J911+K911","v":0},""]
[null,{"v":500,"d":"05-00"},"Задължителни осигурителни вноски от работодатели",null,{"$f":"SUM(E913:E919)","v":0},0,0,{"$f":"SUM(H913:H919)","v":0},0,0,0,0,""]
[null,null,{"v":551,"d":"05-51"},"осигурителни вноски от работодатели за Държавното обществено осигуряване (ДОО)",{"$f":"F913+G913+H913","v":0},{"$nulls":6},{"$f":"I913+J913+K913","v":0},""]
[null,null,{"v":552,"d":"05-52"},"осигурителни вноски от работодатели за Учителския пенсионен фонд (УчПФ)",0,{"$nulls":6},0,""]
[null,null,{"v":558,"d":"05-58"},"вноски по чл. 4б и 4в от КСО за сметка на осигурителя",{"$f":"F915+G915+H915","v":0},0,0,0,0,0,0,{"$f":"I915+J915+K915","v":0},""]
[null,null,{"v":560,"d":"05-60"},"здравно-осигурителни вноски от работодатели",0,{"$nulls":6},0,""]
[null,null,{"v":580,"d":"05-80"},"вноски за допълнително задължително осигуряване от работодатели",0,{"$nulls":6},0,""]
[null,null,{"v":588,"d":"05-88"},"коректив на вноски за ДЗПО за сумите по чл. 4б и 4в от КСО за сметка на осигурителя",{"$f":"F918+G918+H918","v":0},0,0,0,0,0,0,{"$f":"I918+J918+K918","v":0},""]
[null,null,{"v":590,"d":"05-90"},"задължителни вноски за чуждестранни пенсионни фондове и  схеми за сметка на осигурителя",0,{"$nulls":6},0,""]
[5,{"v":800,"d":"08-00"},"Вноски за доброволно осигуряване  ",null,0,{"$nulls":6},0,""]
[10,{"v":1000,"d":"10-00"},"Издръжка",null,{"$f":"SUM(E922:E938)","v":0},0,0,{"$f":"SUM(H922:H938)","v":0},0,0,0,0,""]
[15,null,{"v":1011,"d":"10-11"},"Храна",{"$f":"F922+G922+H922","v":0},{"$nulls":6},{"$f":"I922+J922+K922","v":0},""]
[35,null,{"v":1012,"d":"10-12"},"Медикаменти",0,{"$nulls":6},0,""]
[40,null,{"v":1013,"d":"10-13"},"Постелен инвентар и облекло",0,{"$nulls":6},0,""]
[45,null,{"v":1014,"d":"10-14"},"Учебни и научно-изследователски разходи и книги за библиотеките",0,{"$nulls":6},0,""]
[50,null,{"v":1015,"d":"10-15"},"материали",0,{"$nulls":6},0,""]
[55,null,{"v":1016,"d":"10-16"},"вода, горива и енергия",0,{"$nulls":6},0,""]
[60,null,{"v":1020,"d":"10-20"},"разходи за външни услуги",0,{"$nulls":6},0,""]
[65,null,{"v":1030,"d":"10-30"},"Текущ ремонт",0,{"$nulls":6},0,""]
[70,null,{"v":1051,"d":"10-51"},"командировки в страната",0,{"$nulls":6},0,""]
[75,null,{"v":1052,"d":"10-52"},"краткосрочни командировки в чужбина",0,{"$nulls":6},0,""]
[80,null,{"v":1053,"d":"10-53"},"дългосрочни командировки в чужбина",0,{"$nulls":6},0,""]
[80,null,{"v":1062,"d":"10-62"},"разходи за застраховки",0,{"$nulls":6},0,""]
[85,null,{"v":1063,"d":"10-63"},"такса ангажимент по заеми",0,{"$nulls":6},0,""]
[90,null,{"v":1069,"d":"10-69"},"други финансови услуги",0,{"$nulls":6},0,""]
[90,null,{"v":1091,"d":"10-91"},"други разходи за СБКО",0,{"$nulls":6},0,""]
[115,null,{"v":1092,"d":"10-92"},"разходи за договорни санкции и неустойки, съдебни обезщетения и разноски",0,{"$nulls":6},0,""]
[125,null,{"v":1098,"d":"10-98"},"други разходи, некласифицирани в другите параграфи и подпараграфи",0,{"$nulls":6},0,""]
[130,{"v":1900,"d":"19-00"},"Платени данъци, такси и административни санкции",null,{"$f":"SUM(E940:E942)","v":0},0,0,{"$f":"SUM(H940:H942)","v":0},0,0,0,0,""]
[135,null,{"v":1901,"d":"19-01"},"платени държавни данъци, такси, наказателни лихви и административни санкции",{"$f":"F940+G940+H940","v":0},{"$nulls":6},{"$f":"I940+J940+K940","v":0},""]
[140,null,{"v":1981,"d":"19-81"},"платени общински данъци, такси, наказателни лихви и административни санкции",{"$f":"F941+G941+H941","v":0},{"$nulls":6},{"$f":"I941+J941+K941","v":0},""]
[145,null,{"v":1991,"d":"19-91"},"платени данъци, такси, наказателни лихви и административни санкции в чужбина",{"$f":"F942+G942+H942","v":0},{"$nulls":6},{"$f":"I942+J942+K942","v":0},""]
[150,{"v":2100,"d":"21-00"},"Разходи за лихви по емисии на държавни (общински) ценни книжа",null,{"$f":"SUM(E944:E948)","v":0},0,0,{"$f":"SUM(H944:H948)","v":0},0,0,0,0,""]
[155,null,{"v":2110,"d":"21-10"},"лихви по държавни (общински) ценни книжа",{"$f":"F944+G944+H944","v":0},{"$nulls":6},{"$f":"I944+J944+K944","v":0},""]
[160,null,{"v":2120,"d":"21-20"},"отстъпки по държавни (общински) ценни книжа",{"$f":"F945+G945+H945","v":0},{"$nulls":6},{"$f":"I945+J945+K945","v":0},""]
[165,null,{"v":2125,"d":"21-25"},"лихви и отстъпки по целеви емисии на държавни ценни книжа",{"$f":"F946+G946+H946","v":0},0,0,0,0,0,0,{"$f":"I946+J946+K946","v":0},""]
[175,null,{"v":2140,"d":"21-40"},"лихви по държавни ценни книжа, емитирани за структурната реформа ",{"$f":"F947+G947+H947","v":0},0,0,0,0,0,0,{"$f":"I947+J947+K947","v":0},""]
[180,null,{"v":2190,"d":"21-90"},"премии над номинала от емисии на държавни (общински) ценни книжа (-)",{"$f":"F948+G948+H948","v":0},{"$nulls":6},{"$f":"I948+J948+K948","v":0},""]
[185,{"v":2200,"d":"22-00"},"Разходи за лихви по заеми от страната",null,{"$f":"SUM(E950:E951)","v":0},0,0,{"$f":"SUM(H950:H951)","v":0},0,0,0,0,""]
[190,null,{"v":2221,"d":"22-21"},"Разходи за лихви по заеми от банки в страната",{"$f":"F950+G950+H950","v":0},{"$nulls":6},{"$f":"I950+J950+K950","v":0},""]
[200,null,{"v":2224,"d":"22-24"},"Разходи за лихви по други заеми от страната",0,{"$nulls":6},0,""]
[200,{"v":2500,"d":"25-00"},"Разходи за лихви по заеми от други държави",null,0,{"$nulls":6},0,""]
[205,{"v":2600,"d":"26-00"},"Разходи за лихви по заеми от международни организации и институции",null,0,{"$nulls":6},0,""]
[210,{"v":2700,"d":"27-00"},"Разходи за лихви по заеми от банки и други финансови институции от чужбина",null,0,{"$nulls":6},0,""]
[215,{"v":2800,"d":"28-00"},"Разходи за лихви и отстъпки по облигации, емитирани и търгувани на международните капиталови пазари",null,0,{"$nulls":6},0,""]
[220,{"v":2900,"d":"29-00"},"Други разходи за лихви",null,{"$f":"SUM(E957:E964)","v":0},{"$f":"SUM(F957:F964)","v":0},{"$f":"SUM(G957:G964)","v":0},0,0,0,0,0,""]
[225,null,{"v":2910,"d":"29-10"},"Платени лихви по финансов лизинг и търговски кредит",{"$f":"F957+G957+H957","v":0},{"$nulls":6},{"$f":"I957+J957+K957","v":0},""]
[230,null,{"v":2920,"d":"29-20"},"Платени лихви по активирани гаранции по заеми от  банки в страната",{"$f":"F958+G958+H958","v":0},{"$nulls":6},{"$f":"I958+J958+K958","v":0},""]
[245,null,{"v":2969,"d":"29-69"},"Платени лихви по активирани гаранции по заеми от международни организации и институции",0,{"$nulls":6},0,""]
[220,null,{"v":2970,"d":"29-70"},"Платени лихви по активирани гаранции по заеми от банки и финансови институции от чужбина",0,{"$nulls":6},0,""]
[225,null,{"v":2989,"d":"29-89"},"Възстановени суми по платени лихви по активирани гаранции (-)",0,{"$nulls":6},0,""]
[230,null,{"v":2990,"d":"29-90"},"Платени лихви по активирани гаранции по заеми от  банки в страната",{"$f":"F962+G962+H962","v":0},{"$nulls":6},{"$f":"I962+J962+K962","v":0},""]
[235,null,{"v":2991,"d":"29-91"},"Други разходи за лихви към  местни лица",0,{"$nulls":6},0,""]
[240,null,{"v":2992,"d":"29-92"},"Други разходи за лихви към чуждестранни лица",0,{"$nulls":6},0,""]
[245,{"v":3300,"d":"33-00"},"Вноска в общия бюджет на Европейския съюз",null,{"$f":"SUM(E966:E970)","v":0},0,0,0,0,0,0,0,""]
[250,null,{"v":3301,"d":"33-01"},"ресурс на база брутен национален доход",{"$f":"F966+G966+H966","v":0},0,0,0,0,0,0,{"$f":"I966+J966+K966","v":0},""]
[255,null,{"v":3302,"d":"33-02"},"ресурс на база данък върху добавената стойност",0,0,0,0,0,0,0,0,""]
[265,null,{"v":3303,"d":"33-03"},"корекция за Обединеното кралство",0,0,0,0,0,0,0,0,""]
[270,null,{"v":3304,"d":"33-04"},"традиционни собствени ресурси - мита",0,0,0,0,0,0,0,0,""]
[290,null,{"v":3306,"d":"33-06"},"участие във финансирането на брутното намаление за Нидерландия, Швеция, Дания и Австрия",0,0,0,0,0,0,0,0,""]
[320,{"v":3900,"d":"39-00"},"Здравно-осигурителни плащания",null,0,0,0,0,0,0,0,0,{"$f":"(IF($E971<>0,$M$2,IF($L971<>0,$M$2,\"\")))","v":""}]
[330,{"v":4000,"d":"40-00"},"Стипендии",null,0,{"$nulls":6},0,""]
[350,{"v":4100,"d":"41-00"},"Пенсии",null,0,0,0,0,0,0,0,0,""]
[355,{"v":4200,"d":"42-00"},"Текущи трансфери, обезщетения и помощи за домакинствата",null,{"$f":"SUM(E975:E980)","v":0},0,0,{"$f":"SUM(H975:H980)","v":0},0,0,0,0,""]
[355,null,{"v":4201,"d":"42-01"},"обезщетения и помощи по социалното осигуряване",{"$f":"F975+G975+H975","v":0},{"$nulls":6},{"$f":"I975+J975+K975","v":0},""]
[375,null,{"v":4202,"d":"42-02"},"обезщетения и помощи по социалното подпомагане",0,{"$nulls":6},0,""]
[380,null,{"v":4214,"d":"42-14"},"обезщетения и помощи по решение на общинския съвет",0,{"$nulls":6},0,""]
[385,null,{"v":4217,"d":"42-17"},"текущи трансфери за домакинства от средства на Европейския съюз",0,{"$nulls":6},0,""]
[390,null,{"v":4218,"d":"42-18"},"текущи трансфери за домакинства по други международни програми и споразумения",0,{"$nulls":6},0,""]
[390,null,{"v":4219,"d":"42-19"},"други текущи трансфери за домакинствата",0,{"$nulls":6},0,""]
[395,{"v":4300,"d":"43-00"},"Субсидии и други текущи трансфери за нефинансови предприятия",null,{"$f":"SUM(E982:E984)","v":0},0,0,{"$f":"SUM(H982:H984)","v":0},0,0,0,0,""]
[397,null,{"v":4301,"d":"43-01"},"за текуща дейност",{"$f":"F982+G982+H982","v":0},{"$nulls":6},{"$f":"I982+J982+K982","v":0},""]
[398,null,{"v":4302,"d":"43-02"},"за осъществяване на болнична помощ ",0,{"$nulls":6},0,""]
[399,null,{"v":4309,"d":"43-09"},"други субсидии и плащания",0,{"$nulls":6},0,""]
[400,{"v":4400,"d":"44-00"},"Субсидии и други текущи трансфери за финансови институции",null,0,{"$nulls":6},0,""]
[401,{"v":4500,"d":"45-00"},"Субсидии и други текущи трансфери за юридически лица с нестопанска цел",null,0,{"$nulls":6},0,""]
[404,{"v":4600,"d":"46-00"},"Разходи за членски внос и участие в нетърговски организации и дейности",null,0,{"$nulls":6},0,""]
[404,{"v":4900,"d":"49-00"},"Предоставени текущи и капиталови трансфери за чужбина",null,{"$f":"+E989+E990","v":0},0,0,{"$f":"+H989+H990","v":0},0,0,0,0,""]
[440,null,{"v":4901,"d":"49-01"},"текущи трансфери за чужбина",{"$f":"F989+G989+H989","v":0},{"$nulls":6},{"$f":"I989+J989+K989","v":0},""]
[450,null,{"v":4902,"d":"49-02"},"капиталови трансфери за чужбина",{"$f":"F990+G990+H990","v":0},{"$nulls":6},{"$f":"I990+J990+K990","v":0},""]
[495,{"v":5100,"d":"51-00"},"Основен ремонт на дълготрайни материални активи",null,{"$f":"F991+G991+H991","v":0},{"$nulls":6},{"$f":"I991+J991+K991","v":0},""]
[500,{"v":5200,"d":"52-00"},"Придобиване на дълготрайни материални активи",null,{"$f":"SUM(E993:E999)","v":0},0,0,{"$f":"SUM(H993:H999)","v":0},0,0,0,0,""]
[505,null,{"v":5201,"d":"52-01"},"придобиване на компютри и хардуер",{"$f":"F993+G993+H993","v":0},{"$nulls":6},{"$f":"I993+J993+K993","v":0},""]
[510,null,{"v":5202,"d":"52-02"},"придобиване на сгради",0,{"$nulls":6},0,""]
[515,null,{"v":5203,"d":"52-03"},"придобиване на друго оборудване, машини и съоръжения",0,{"$nulls":6},0,""]
[520,null,{"v":5204,"d":"52-04"},"придобиване на транспортни средства",0,{"$nulls":6},0,""]
[525,null,{"v":5205,"d":"52-05"},"придобиване на стопански инвентар",0,{"$nulls":6},0,""]
[635,null,{"v":5206,"d":"52-06"},"изграждане на инфраструктурни обекти",0,{"$nulls":6},0,""]
[640,null,{"v":5219,"d":"52-19"},"придобиване на други ДМА",0,{"$nulls":6},0,""]
[645,{"v":5300,"d":"53-00"},"Придобиване на нематериални дълготрайни активи",null,{"$f":"SUM(E1001:E1002)","v":0},0,0,{"$f":"SUM(H1001:H1002)","v":0},0,0,0,0,""]
[650,null,{"v":5301,"d":"53-01"},"придобиване на програмни продукти и лицензи за програмни продукти",{"$f":"F1001+G1001+H1001","v":0},{"$nulls":6},{"$f":"I1001+J1001+K1001","v":0},""]
[655,null,{"v":5309,"d":"53-09"},"придобиване на други нематериални дълготрайни активи",{"$f":"F1002+G1002+H1002","v":0},{"$nulls":6},{"$f":"I1002+J1002+K1002","v":0},""]
[665,{"v":5400,"d":"54-00"},"Придобиване на земя",null,{"$f":"F1003+G1003+H1003","v":0},{"$nulls":6},{"$f":"I1003+J1003+K1003","v":0},""]
[675,{"v":5500,"d":"55-00"},"Капиталови трансфери",null,{"$f":"SUM(E1005:E1008)","v":0},0,0,{"$f":"SUM(H1005:H1008)","v":0},0,0,0,0,""]
[685,null,{"v":5501,"d":"55-01"},"капиталови трансфери за нефинансови предприятия",{"$f":"F1005+G1005+H1005","v":0},{"$nulls":6},{"$f":"I1005+J1005+K1005","v":0},""]
[690,null,{"v":5502,"d":"55-02"},"капиталови трансфери за финансови институции",{"$f":"F1006+G1006+H1006","v":0},{"$nulls":6},{"$f":"I1006+J1006+K1006","v":0},""]
[695,null,{"v":5503,"d":"55-03"},"капиталови трансфери за организации с нестопанска цел",{"$f":"F1007+G1007+H1007","v":0},{"$nulls":6},{"$f":"I1007+J1007+K1007","v":0},""]
[700,null,{"v":5504,"d":"55-04"},"капиталови трансфери за домакинствата",{"$f":"F1008+G1008+H1008","v":0},{"$nulls":6},{"$f":"I1008+J1008+K1008","v":0},""]
[710,{"v":5700,"d":"57-00"},"Прираст на държавния резерв и изкупуване на земеделска продукция (включва и § 40-71)",null,{"$f":"SUM(E1010:E1012)","v":0},0,0,0,0,0,0,{"$f":"SUM(L1010:L1012)","v":0},""]
[715,null,{"v":5701,"d":"57-01"},"плащания за попълване на държавния резерв",{"$f":"F1010+G1010+H1010","v":0},0,0,0,0,0,0,{"$f":"I1010+J1010+K1010","v":0},""]
[720,null,{"v":5702,"d":"57-02"},"плащания за изкупуване на земеделска продукция",{"$f":"F1011+G1011+H1011","v":0},0,0,0,0,0,0,{"$f":"I1011+J1011+K1011","v":0},""]
[725,null,{"v":4071,"d":"40-71"},"постъпления от продажба на държавния резерв (-)",{"$f":"F1012+G1012+H1012","v":0},0,0,0,0,0,0,{"$f":"I1012+J1012+K1012","v":0},""]
[730,null,"Резерв за непредвидени и неотложни разходи",{"$nulls":9},""]
[735,{"v":98,"d":"00-98"},"Резерв за непредвидени и неотложни разходи",null,{"$f":"F1014+G1014+H1014","v":0},{"$nulls":3},0,0,0,{"$f":"I1014+J1014+K1014","v":0},""]
[740,{"$nulls":11},""]
[745,{"$nulls":11},""]
[750,{"$nulls":11},""]
[755,null,"99-99",{"$f":"+B1018","v":{"v":0,"d":"II. ОБЩО РАЗХОДИ ЗА ДЕЙНОСТ 0000"}},{"$f":"SUM(E903,E906,E912,E920,E921,E939,E943,E949,E952,E953,E954,E955,E956,E965,E971,E972,E973,E974,E981,E985,E986,E987,E988,E991,E992,E1000,E1003,E1004,E1009)+E1014","v":0},0,0,0,0,0,0,0,{"$f":"(IF($E1018<>0,$M$2,IF($L1018<>0,$M$2,\"\")))","v":""},{"$f":"LEFT(C900,1)","v":"3"}]
[760,"край на дейност",{"$nulls":10},{"$f":"(IF($E1018<>0,$M$2,IF($L1018<>0,$M$2,\"\")))","v":""}]
[765,{"$nulls":11},{"$f":"(IF($E1018<>0,$M$2,IF($L1018<>0,$M$2,\"\")))","v":""}]
[775,{"$nulls":11},{"$f":"(IF(E1016<>0,$G$2,IF(L1016<>0,$G$2,\"\")))","v":""}]
[780,{"$nulls":11},{"$f":"(IF($E1155<>0,$M$2,IF($L1155<>0,$M$2,\"\")))","v":""}]
[785,{"$nulls":11},{"$f":"(IF($E1155<>0,$M$2,IF($L1155<>0,$M$2,\"\")))","v":""}]
[790,{"$f":"$B$7","v":"ОТЧЕТНИ ДАННИ ПО ЕБК ЗА СМЕТКИТЕ ЗА СРЕДСТВАТА ОТ ЕВРОПЕЙСКИЯ СЪЮЗ - КСФ"},{"$nulls":10},{"$f":"(IF($E1155<>0,$M$2,IF($L1155<>0,$M$2,\"\")))","v":""}]
[795,{"$nulls":3},"за периода от ","до",null,"        II.1. РАЗХОДИ ПО ДЕЙНОСТИ",{"$nulls":4},{"$f":"(IF($E1155<>0,$M$2,IF($L1155<>0,$M$2,\"\")))","v":""}]
[805,{"$f":"$B$9","v":"ДЕТСКА ГРАДИНА \"НАРЦИС\""},null,null,{"$f":"$E$9","v":"2020-01-01"},{"$f":"$F$9","v":"2020-06-30"},{"$nulls":6},{"$f":"(IF($E1155<>0,$M$2,IF($L1155<>0,$M$2,\"\")))","v":""}]
[810,{"$f":"$B$10","v":"(наименование на разпоредителя с бюджет)"},{"$nulls":10},{"$f":"(IF($E1155<>0,$M$2,IF($L1155<>0,$M$2,\"\")))","v":""}]
[815,{"$nulls":11},{"$f":"(IF($E1155<>0,$M$2,IF($L1155<>0,$M$2,\"\")))","v":""}]
[525,{"$f":"$B$12","v":"Силистра"},null,null,"       код по ЕБК:",{"$f":"$F$12","v":"6905"},{"$nulls":6},{"$f":"(IF($E1155<>0,$M$2,IF($L1155<>0,$M$2,\"\")))","v":""}]
[820,{"$f":"$B$13","v":"(наименование на първостепенния разпоредител с бюджет)"},{"$nulls":10},{"$f":"(IF($E1155<>0,$M$2,IF($L1155<>0,$M$2,\"\")))","v":""}]
[821,null,null,"ФИНАНСОВО-ПРАВНА ФОРМА",{"$f":"$E$15","v":98},{"$f":"$F$15","v":"СЕС - КСФ"},{"$nulls":6},{"$f":"(IF($E1155<>0,$M$2,IF($L1155<>0,$M$2,\"\")))","v":""}]
[822,{"$nulls":10},"(в лева)",{"$f":"(IF($E1155<>0,$M$2,IF($L1155<>0,$M$2,\"\")))","v":""}]
[823,null,null,"II.1. РАЗХОДИ ПО ДЕЙНОСТИ","Уточнен план 2020",{"$nulls":3},"Отчет 2020",{"$nulls":3},{"$f":"(IF($E1155<>0,$M$2,IF($L1155<>0,$M$2,\"\")))","v":""}]
[825,"§§","под-§§","НАИМЕНОВАНИЯ НА ПАРАГРАФИТЕ И ПОДПАРАГРАФИТЕ",{"$f":"$E$20","v":"Уточнен план                Общо"},{"$f":"$F$20","v":"държавни дейности"},{"$f":"$G$20","v":"местни дейности"},{"$f":"$H$20","v":"дофинансиране"},{"$f":"$I$20","v":"държавни дейности -ОТЧЕТ"},{"$f":"$J$20","v":"местни дейности - ОТЧЕТ"},{"$f":"$K$20","v":"дофинансиране - ОТЧЕТ"},{"$f":"$L$20","v":"ОТЧЕТ                                    ОБЩО"},{"$f":"(IF($E1155<>0,$M$2,IF($L1155<>0,$M$2,\"\")))","v":""}]
[{"$nulls":3}," 02 ¦",{"$f":"$E$21","v":"(1)"},{"$f":"$F$21","v":"(2)"},{"$f":"$G$21","v":"(3)"},{"$f":"$H$21","v":"(4)"},{"$f":"$I$21","v":"(5)"},{"$f":"$J$21","v":"(6)"},{"$f":"$K$21","v":"(7)"},{"$f":"$L$21","v":"(8)"},{"$f":"(IF($E1155<>0,$M$2,IF($L1155<>0,$M$2,\"\")))","v":""}]
[null,null,{"$f":"VLOOKUP(D1036,OP_LIST2,2,FALSE)","v":0},"ИЗБЕРЕТЕ ОПЕРАТИВНА ПРОГРАМА ",{"$nulls":8},{"$f":"(IF($E1155<>0,$M$2,IF($L1155<>0,$M$2,\"\")))","v":""}]
[null,null,{"$f":"VLOOKUP(D1038,EBK_DEIN2,2,FALSE)","v":{"v":0,"d":"0000"}},"<------          ДЕЙНОСТ    -  код  по  ЕБК",{"$nulls":8},{"$f":"(IF($E1155<>0,$M$2,IF($L1155<>0,$M$2,\"\")))","v":""}]
[null,null,{"$f":"+C1037","v":0},"ИЗБЕРЕТЕ ДЕЙНОСТ",{"$nulls":8},{"$f":"(IF($E1155<>0,$M$2,IF($L1155<>0,$M$2,\"\")))","v":""}]
[{"$nulls":3},"(наименование на дейността)",{"$nulls":8},{"$f":"(IF($E1155<>0,$M$2,IF($L1155<>0,$M$2,\"\")))","v":""}]
[null,{"v":100,"d":"01-00"},"Заплати и възнаграждения за персонала, нает по трудови и служебни правоотношения",null,{"$f":"SUM(E1041:E1042)","v":0},0,0,{"$f":"SUM(H1041:H1042)","v":0},0,0,0,0,{"$f":"(IF($E1040<>0,$M$2,IF($L1040<>0,$M$2,\"\")))","v":""}]
[null,null,{"v":101,"d":"01-01"},"заплати и възнаграждения на персонала нает по трудови правоотношения",{"$f":"F1041+G1041+H1041","v":0},{"$nulls":6},{"$f":"I1041+J1041+K1041","v":0},{"$f":"(IF($E1041<>0,$M$2,IF($L1041<>0,$M$2,\"\")))","v":""}]
[null,null,{"v":102,"d":"01-02"},"заплати и възнаграждения на персонала нает по служебни правоотношения",{"$f":"F1042+G1042+H1042","v":0},{"$nulls":6},{"$f":"I1042+J1042+K1042","v":0},""]
[null,{"v":200,"d":"02-00"},"Други възнаграждения и плащания за персонала",null,{"$f":"SUM(E1044:E1048)","v":0},0,0,{"$f":"SUM(H1044:H1048)","v":0},0,0,0,0,""]
[null,null,{"v":201,"d":"02-01"},"за нещатен персонал нает по трудови правоотношения ",{"$f":"F1044+G1044+H1044","v":0},{"$nulls":6},{"$f":"I1044+J1044+K1044","v":0},""]
[null,null,{"v":202,"d":"02-02"},"за персонала по извънтрудови правоотношения",{"$f":"F1045+G1045+H1045","v":0},{"$nulls":6},{"$f":"I1045+J1045+K1045","v":0},""]
[null,null,{"v":205,"d":"02-05"},"изплатени суми от СБКО за облекло и други на персонала, с характер на възнаграждение",{"$f":"F1046+G1046+H1046","v":0},{"$nulls":6},{"$f":"I1046+J1046+K1046","v":0},""]
[null,null,{"v":208,"d":"02-08"},"обезщетения за персонала, с характер на възнаграждение",{"$f":"F1047+G1047+H1047","v":0},{"$nulls":6},{"$f":"I1047+J1047+K1047","v":0},""]
[null,null,{"v":209,"d":"02-09"},"другиплащания и възнаграждения",{"$f":"F1048+G1048+H1048","v":0},{"$nulls":6},{"$f":"I1048+J1048+K1048","v":0},""]
[null,{"v":500,"d":"05-00"},"Задължителни осигурителни вноски от работодатели",null,{"$f":"SUM(E1050:E1056)","v":0},0,0,{"$f":"SUM(H1050:H1056)","v":0},0,0,0,0,""]
[null,null,{"v":551,"d":"05-51"},"осигурителни вноски от работодатели за Държавното обществено осигуряване (ДОО)",{"$f":"F1050+G1050+H1050","v":0},{"$nulls":6},{"$f":"I1050+J1050+K1050","v":0},""]
[null,null,{"v":552,"d":"05-52"},"осигурителни вноски от работодатели за Учителския пенсионен фонд (УчПФ)",0,{"$nulls":6},0,""]
[null,null,{"v":558,"d":"05-58"},"вноски по чл. 4б и 4в от КСО за сметка на осигурителя",{"$f":"F1052+G1052+H1052","v":0},0,0,0,0,0,0,{"$f":"I1052+J1052+K1052","v":0},""]
[null,null,{"v":560,"d":"05-60"},"здравно-осигурителни вноски от работодатели",0,{"$nulls":6},0,""]
[null,null,{"v":580,"d":"05-80"},"вноски за допълнително задължително осигуряване от работодатели",0,{"$nulls":6},0,""]
[null,null,{"v":588,"d":"05-88"},"коректив на вноски за ДЗПО за сумите по чл. 4б и 4в от КСО за сметка на осигурителя",{"$f":"F1055+G1055+H1055","v":0},0,0,0,0,0,0,{"$f":"I1055+J1055+K1055","v":0},""]
[null,null,{"v":590,"d":"05-90"},"задължителни вноски за чуждестранни пенсионни фондове и  схеми за сметка на осигурителя",0,{"$nulls":6},0,""]
[5,{"v":800,"d":"08-00"},"Вноски за доброволно осигуряване  ",null,0,{"$nulls":6},0,""]
[10,{"v":1000,"d":"10-00"},"Издръжка",null,{"$f":"SUM(E1059:E1075)","v":0},0,0,{"$f":"SUM(H1059:H1075)","v":0},0,0,0,0,""]
[15,null,{"v":1011,"d":"10-11"},"Храна",{"$f":"F1059+G1059+H1059","v":0},{"$nulls":6},{"$f":"I1059+J1059+K1059","v":0},""]
[35,null,{"v":1012,"d":"10-12"},"Медикаменти",0,{"$nulls":6},0,""]
[40,null,{"v":1013,"d":"10-13"},"Постелен инвентар и облекло",0,{"$nulls":6},0,""]
[45,null,{"v":1014,"d":"10-14"},"Учебни и научно-изследователски разходи и книги за библиотеките",0,{"$nulls":6},0,""]
[50,null,{"v":1015,"d":"10-15"},"материали",0,{"$nulls":6},0,""]
[55,null,{"v":1016,"d":"10-16"},"вода, горива и енергия",0,{"$nulls":6},0,""]
[60,null,{"v":1020,"d":"10-20"},"разходи за външни услуги",0,{"$nulls":6},0,""]
[65,null,{"v":1030,"d":"10-30"},"Текущ ремонт",0,{"$nulls":6},0,""]
[70,null,{"v":1051,"d":"10-51"},"командировки в страната",0,{"$nulls":6},0,""]
[75,null,{"v":1052,"d":"10-52"},"краткосрочни командировки в чужбина",0,{"$nulls":6},0,""]
[80,null,{"v":1053,"d":"10-53"},"дългосрочни командировки в чужбина",0,{"$nulls":6},0,""]
[80,null,{"v":1062,"d":"10-62"},"разходи за застраховки",0,{"$nulls":6},0,""]
[85,null,{"v":1063,"d":"10-63"},"такса ангажимент по заеми",0,{"$nulls":6},0,""]
[90,null,{"v":1069,"d":"10-69"},"други финансови услуги",0,{"$nulls":6},0,""]
[90,null,{"v":1091,"d":"10-91"},"други разходи за СБКО",0,{"$nulls":6},0,""]
[115,null,{"v":1092,"d":"10-92"},"разходи за договорни санкции и неустойки, съдебни обезщетения и разноски",0,{"$nulls":6},0,""]
[125,null,{"v":1098,"d":"10-98"},"други разходи, некласифицирани в другите параграфи и подпараграфи",0,{"$nulls":6},0,""]
[130,{"v":1900,"d":"19-00"},"Платени данъци, такси и административни санкции",null,{"$f":"SUM(E1077:E1079)","v":0},0,0,{"$f":"SUM(H1077:H1079)","v":0},0,0,0,0,""]
[135,null,{"v":1901,"d":"19-01"},"платени държавни данъци, такси, наказателни лихви и административни санкции",{"$f":"F1077+G1077+H1077","v":0},{"$nulls":6},{"$f":"I1077+J1077+K1077","v":0},""]
[140,null,{"v":1981,"d":"19-81"},"платени общински данъци, такси, наказателни лихви и административни санкции",{"$f":"F1078+G1078+H1078","v":0},{"$nulls":6},{"$f":"I1078+J1078+K1078","v":0},""]
[145,null,{"v":1991,"d":"19-91"},"платени данъци, такси, наказателни лихви и административни санкции в чужбина",{"$f":"F1079+G1079+H1079","v":0},{"$nulls":6},{"$f":"I1079+J1079+K1079","v":0},""]
[150,{"v":2100,"d":"21-00"},"Разходи за лихви по емисии на държавни (общински) ценни книжа",null,{"$f":"SUM(E1081:E1085)","v":0},0,0,{"$f":"SUM(H1081:H1085)","v":0},0,0,0,0,""]
[155,null,{"v":2110,"d":"21-10"},"лихви по държавни (общински) ценни книжа",{"$f":"F1081+G1081+H1081","v":0},{"$nulls":6},{"$f":"I1081+J1081+K1081","v":0},""]
[160,null,{"v":2120,"d":"21-20"},"отстъпки по държавни (общински) ценни книжа",{"$f":"F1082+G1082+H1082","v":0},{"$nulls":6},{"$f":"I1082+J1082+K1082","v":0},""]
[165,null,{"v":2125,"d":"21-25"},"лихви и отстъпки по целеви емисии на държавни ценни книжа",{"$f":"F1083+G1083+H1083","v":0},0,0,0,0,0,0,{"$f":"I1083+J1083+K1083","v":0},""]
[175,null,{"v":2140,"d":"21-40"},"лихви по държавни ценни книжа, емитирани за структурната реформа ",{"$f":"F1084+G1084+H1084","v":0},0,0,0,0,0,0,{"$f":"I1084+J1084+K1084","v":0},""]
[180,null,{"v":2190,"d":"21-90"},"премии над номинала от емисии на държавни (общински) ценни книжа (-)",{"$f":"F1085+G1085+H1085","v":0},{"$nulls":6},{"$f":"I1085+J1085+K1085","v":0},""]
[185,{"v":2200,"d":"22-00"},"Разходи за лихви по заеми от страната",null,{"$f":"SUM(E1087:E1088)","v":0},0,0,{"$f":"SUM(H1087:H1088)","v":0},0,0,0,0,""]
[190,null,{"v":2221,"d":"22-21"},"Разходи за лихви по заеми от банки в страната",{"$f":"F1087+G1087+H1087","v":0},{"$nulls":6},{"$f":"I1087+J1087+K1087","v":0},""]
[200,null,{"v":2224,"d":"22-24"},"Разходи за лихви по други заеми от страната",0,{"$nulls":6},0,""]
[200,{"v":2500,"d":"25-00"},"Разходи за лихви по заеми от други държави",null,0,{"$nulls":6},0,""]
[205,{"v":2600,"d":"26-00"},"Разходи за лихви по заеми от международни организации и институции",null,0,{"$nulls":6},0,""]
[210,{"v":2700,"d":"27-00"},"Разходи за лихви по заеми от банки и други финансови институции от чужбина",null,0,{"$nulls":6},0,""]
[215,{"v":2800,"d":"28-00"},"Разходи за лихви и отстъпки по облигации, емитирани и търгувани на международните капиталови пазари",null,0,{"$nulls":6},0,""]
[220,{"v":2900,"d":"29-00"},"Други разходи за лихви",null,{"$f":"SUM(E1094:E1101)","v":0},{"$f":"SUM(F1094:F1101)","v":0},{"$f":"SUM(G1094:G1101)","v":0},0,0,0,0,0,""]
[225,null,{"v":2910,"d":"29-10"},"Платени лихви по финансов лизинг и търговски кредит",{"$f":"F1094+G1094+H1094","v":0},{"$nulls":6},{"$f":"I1094+J1094+K1094","v":0},""]
[230,null,{"v":2920,"d":"29-20"},"Платени лихви по активирани гаранции по заеми от  банки в страната",{"$f":"F1095+G1095+H1095","v":0},{"$nulls":6},{"$f":"I1095+J1095+K1095","v":0},""]
[245,null,{"v":2969,"d":"29-69"},"Платени лихви по активирани гаранции по заеми от международни организации и институции",0,{"$nulls":6},0,""]
[220,null,{"v":2970,"d":"29-70"},"Платени лихви по активирани гаранции по заеми от банки и финансови институции от чужбина",0,{"$nulls":6},0,""]
[225,null,{"v":2989,"d":"29-89"},"Възстановени суми по платени лихви по активирани гаранции (-)",0,{"$nulls":6},0,""]
[230,null,{"v":2990,"d":"29-90"},"Платени лихви по активирани гаранции по заеми от  банки в страната",{"$f":"F1099+G1099+H1099","v":0},{"$nulls":6},{"$f":"I1099+J1099+K1099","v":0},""]
[235,null,{"v":2991,"d":"29-91"},"Други разходи за лихви към  местни лица",0,{"$nulls":6},0,""]
[240,null,{"v":2992,"d":"29-92"},"Други разходи за лихви към чуждестранни лица",0,{"$nulls":6},0,""]
[245,{"v":3300,"d":"33-00"},"Вноска в общия бюджет на Европейския съюз",null,{"$f":"SUM(E1103:E1107)","v":0},0,0,0,0,0,0,0,""]
[250,null,{"v":3301,"d":"33-01"},"ресурс на база брутен национален доход",{"$f":"F1103+G1103+H1103","v":0},0,0,0,0,0,0,{"$f":"I1103+J1103+K1103","v":0},""]
[255,null,{"v":3302,"d":"33-02"},"ресурс на база данък върху добавената стойност",0,0,0,0,0,0,0,0,""]
[265,null,{"v":3303,"d":"33-03"},"корекция за Обединеното кралство",0,0,0,0,0,0,0,0,""]
[270,null,{"v":3304,"d":"33-04"},"традиционни собствени ресурси - мита",0,0,0,0,0,0,0,0,""]
[290,null,{"v":3306,"d":"33-06"},"участие във финансирането на брутното намаление за Нидерландия, Швеция, Дания и Австрия",0,0,0,0,0,0,0,0,""]
[320,{"v":3900,"d":"39-00"},"Здравно-осигурителни плащания",null,0,0,0,0,0,0,0,0,{"$f":"(IF($E1108<>0,$M$2,IF($L1108<>0,$M$2,\"\")))","v":""}]
[330,{"v":4000,"d":"40-00"},"Стипендии",null,0,{"$nulls":6},0,""]
[350,{"v":4100,"d":"41-00"},"Пенсии",null,0,0,0,0,0,0,0,0,""]
[355,{"v":4200,"d":"42-00"},"Текущи трансфери, обезщетения и помощи за домакинствата",null,{"$f":"SUM(E1112:E1117)","v":0},0,0,{"$f":"SUM(H1112:H1117)","v":0},0,0,0,0,""]
[355,null,{"v":4201,"d":"42-01"},"обезщетения и помощи по социалното осигуряване",{"$f":"F1112+G1112+H1112","v":0},{"$nulls":6},{"$f":"I1112+J1112+K1112","v":0},""]
[375,null,{"v":4202,"d":"42-02"},"обезщетения и помощи по социалното подпомагане",0,{"$nulls":6},0,""]
[380,null,{"v":4214,"d":"42-14"},"обезщетения и помощи по решение на общинския съвет",0,{"$nulls":6},0,""]
[385,null,{"v":4217,"d":"42-17"},"текущи трансфери за домакинства от средства на Европейския съюз",0,{"$nulls":6},0,""]
[390,null,{"v":4218,"d":"42-18"},"текущи трансфери за домакинства по други международни програми и споразумения",0,{"$nulls":6},0,""]
[390,null,{"v":4219,"d":"42-19"},"други текущи трансфери за домакинствата",0,{"$nulls":6},0,""]
[395,{"v":4300,"d":"43-00"},"Субсидии и други текущи трансфери за нефинансови предприятия",null,{"$f":"SUM(E1119:E1121)","v":0},0,0,{"$f":"SUM(H1119:H1121)","v":0},0,0,0,0,""]
[397,null,{"v":4301,"d":"43-01"},"за текуща дейност",{"$f":"F1119+G1119+H1119","v":0},{"$nulls":6},{"$f":"I1119+J1119+K1119","v":0},""]
[398,null,{"v":4302,"d":"43-02"},"за осъществяване на болнична помощ ",0,{"$nulls":6},0,""]
[399,null,{"v":4309,"d":"43-09"},"други субсидии и плащания",0,{"$nulls":6},0,""]
[400,{"v":4400,"d":"44-00"},"Субсидии и други текущи трансфери за финансови институции",null,0,{"$nulls":6},0,""]
[401,{"v":4500,"d":"45-00"},"Субсидии и други текущи трансфери за юридически лица с нестопанска цел",null,0,{"$nulls":6},0,""]
[404,{"v":4600,"d":"46-00"},"Разходи за членски внос и участие в нетърговски организации и дейности",null,0,{"$nulls":6},0,""]
[404,{"v":4900,"d":"49-00"},"Предоставени текущи и капиталови трансфери за чужбина",null,{"$f":"+E1126+E1127","v":0},0,0,{"$f":"+H1126+H1127","v":0},0,0,0,0,""]
[440,null,{"v":4901,"d":"49-01"},"текущи трансфери за чужбина",{"$f":"F1126+G1126+H1126","v":0},{"$nulls":6},{"$f":"I1126+J1126+K1126","v":0},""]
[450,null,{"v":4902,"d":"49-02"},"капиталови трансфери за чужбина",{"$f":"F1127+G1127+H1127","v":0},{"$nulls":6},{"$f":"I1127+J1127+K1127","v":0},""]
[495,{"v":5100,"d":"51-00"},"Основен ремонт на дълготрайни материални активи",null,{"$f":"F1128+G1128+H1128","v":0},{"$nulls":6},{"$f":"I1128+J1128+K1128","v":0},""]
[500,{"v":5200,"d":"52-00"},"Придобиване на дълготрайни материални активи",null,{"$f":"SUM(E1130:E1136)","v":0},0,0,{"$f":"SUM(H1130:H1136)","v":0},0,0,0,0,""]
[505,null,{"v":5201,"d":"52-01"},"придобиване на компютри и хардуер",{"$f":"F1130+G1130+H1130","v":0},{"$nulls":6},{"$f":"I1130+J1130+K1130","v":0},""]
[510,null,{"v":5202,"d":"52-02"},"придобиване на сгради",0,{"$nulls":6},0,""]
[515,null,{"v":5203,"d":"52-03"},"придобиване на друго оборудване, машини и съоръжения",0,{"$nulls":6},0,""]
[520,null,{"v":5204,"d":"52-04"},"придобиване на транспортни средства",0,{"$nulls":6},0,""]
[525,null,{"v":5205,"d":"52-05"},"придобиване на стопански инвентар",0,{"$nulls":6},0,""]
[635,null,{"v":5206,"d":"52-06"},"изграждане на инфраструктурни обекти",0,{"$nulls":6},0,""]
[640,null,{"v":5219,"d":"52-19"},"придобиване на други ДМА",0,{"$nulls":6},0,""]
[645,{"v":5300,"d":"53-00"},"Придобиване на нематериални дълготрайни активи",null,{"$f":"SUM(E1138:E1139)","v":0},0,0,{"$f":"SUM(H1138:H1139)","v":0},0,0,0,0,""]
[650,null,{"v":5301,"d":"53-01"},"придобиване на програмни продукти и лицензи за програмни продукти",{"$f":"F1138+G1138+H1138","v":0},{"$nulls":6},{"$f":"I1138+J1138+K1138","v":0},""]
[655,null,{"v":5309,"d":"53-09"},"придобиване на други нематериални дълготрайни активи",{"$f":"F1139+G1139+H1139","v":0},{"$nulls":6},{"$f":"I1139+J1139+K1139","v":0},""]
[665,{"v":5400,"d":"54-00"},"Придобиване на земя",null,{"$f":"F1140+G1140+H1140","v":0},{"$nulls":6},{"$f":"I1140+J1140+K1140","v":0},""]
[675,{"v":5500,"d":"55-00"},"Капиталови трансфери",null,{"$f":"SUM(E1142:E1145)","v":0},0,0,{"$f":"SUM(H1142:H1145)","v":0},0,0,0,0,""]
[685,null,{"v":5501,"d":"55-01"},"капиталови трансфери за нефинансови предприятия",{"$f":"F1142+G1142+H1142","v":0},{"$nulls":6},{"$f":"I1142+J1142+K1142","v":0},""]
[690,null,{"v":5502,"d":"55-02"},"капиталови трансфери за финансови институции",{"$f":"F1143+G1143+H1143","v":0},{"$nulls":6},{"$f":"I1143+J1143+K1143","v":0},""]
[695,null,{"v":5503,"d":"55-03"},"капиталови трансфери за организации с нестопанска цел",{"$f":"F1144+G1144+H1144","v":0},{"$nulls":6},{"$f":"I1144+J1144+K1144","v":0},""]
[700,null,{"v":5504,"d":"55-04"},"капиталови трансфери за домакинствата",{"$f":"F1145+G1145+H1145","v":0},{"$nulls":6},{"$f":"I1145+J1145+K1145","v":0},""]
[710,{"v":5700,"d":"57-00"},"Прираст на държавния резерв и изкупуване на земеделска продукция (включва и § 40-71)",null,{"$f":"SUM(E1147:E1149)","v":0},0,0,0,0,0,0,{"$f":"SUM(L1147:L1149)","v":0},""]
[715,null,{"v":5701,"d":"57-01"},"плащания за попълване на държавния резерв",{"$f":"F1147+G1147+H1147","v":0},0,0,0,0,0,0,{"$f":"I1147+J1147+K1147","v":0},""]
[720,null,{"v":5702,"d":"57-02"},"плащания за изкупуване на земеделска продукция",{"$f":"F1148+G1148+H1148","v":0},0,0,0,0,0,0,{"$f":"I1148+J1148+K1148","v":0},""]
[725,null,{"v":4071,"d":"40-71"},"постъпления от продажба на държавния резерв (-)",{"$f":"F1149+G1149+H1149","v":0},0,0,0,0,0,0,{"$f":"I1149+J1149+K1149","v":0},""]
[730,null,"Резерв за непредвидени и неотложни разходи",{"$nulls":9},""]
[735,{"v":98,"d":"00-98"},"Резерв за непредвидени и неотложни разходи",null,{"$f":"F1151+G1151+H1151","v":0},{"$nulls":3},0,0,0,{"$f":"I1151+J1151+K1151","v":0},""]
[740,{"$nulls":11},""]
[745,{"$nulls":11},""]
[750,{"$nulls":11},""]
[755,null,"99-99",{"$f":"+B1155","v":{"v":0,"d":"II. ОБЩО РАЗХОДИ ЗА ДЕЙНОСТ 0000"}},{"$f":"SUM(E1040,E1043,E1049,E1057,E1058,E1076,E1080,E1086,E1089,E1090,E1091,E1092,E1093,E1102,E1108,E1109,E1110,E1111,E1118,E1122,E1123,E1124,E1125,E1128,E1129,E1137,E1140,E1141,E1146)+E1151","v":0},0,0,0,0,0,0,0,{"$f":"(IF($E1155<>0,$M$2,IF($L1155<>0,$M$2,\"\")))","v":""},{"$f":"LEFT(C1037,1)","v":"0"}]
[760,"край на дейност",{"$nulls":10},{"$f":"(IF($E1155<>0,$M$2,IF($L1155<>0,$M$2,\"\")))","v":""}]
[765,{"$nulls":11},{"$f":"(IF($E1155<>0,$M$2,IF($L1155<>0,$M$2,\"\")))","v":""}]
[775,{"$nulls":11},{"$f":"(IF(E1153<>0,$G$2,IF(L1153<>0,$G$2,\"\")))","v":""}]
[780,{"$nulls":11},{"$f":"(IF($E1292<>0,$M$2,IF($L1292<>0,$M$2,\"\")))","v":""}]
[785,{"$nulls":11},{"$f":"(IF($E1292<>0,$M$2,IF($L1292<>0,$M$2,\"\")))","v":""}]
[790,{"$f":"$B$7","v":"ОТЧЕТНИ ДАННИ ПО ЕБК ЗА СМЕТКИТЕ ЗА СРЕДСТВАТА ОТ ЕВРОПЕЙСКИЯ СЪЮЗ - КСФ"},{"$nulls":10},{"$f":"(IF($E1292<>0,$M$2,IF($L1292<>0,$M$2,\"\")))","v":""}]
[795,{"$nulls":3},"за периода от ","до",null,"        II.1. РАЗХОДИ ПО ДЕЙНОСТИ",{"$nulls":4},{"$f":"(IF($E1292<>0,$M$2,IF($L1292<>0,$M$2,\"\")))","v":""}]
[805,{"$f":"$B$9","v":"ДЕТСКА ГРАДИНА \"НАРЦИС\""},null,null,{"$f":"$E$9","v":"2020-01-01"},{"$f":"$F$9","v":"2020-06-30"},{"$nulls":6},{"$f":"(IF($E1292<>0,$M$2,IF($L1292<>0,$M$2,\"\")))","v":""}]
[810,{"$f":"$B$10","v":"(наименование на разпоредителя с бюджет)"},{"$nulls":10},{"$f":"(IF($E1292<>0,$M$2,IF($L1292<>0,$M$2,\"\")))","v":""}]
[815,{"$nulls":11},{"$f":"(IF($E1292<>0,$M$2,IF($L1292<>0,$M$2,\"\")))","v":""}]
[525,{"$f":"$B$12","v":"Силистра"},null,null,"       код по ЕБК:",{"$f":"$F$12","v":"6905"},{"$nulls":6},{"$f":"(IF($E1292<>0,$M$2,IF($L1292<>0,$M$2,\"\")))","v":""}]
[820,{"$f":"$B$13","v":"(наименование на първостепенния разпоредител с бюджет)"},{"$nulls":10},{"$f":"(IF($E1292<>0,$M$2,IF($L1292<>0,$M$2,\"\")))","v":""}]
[821,null,null,"ФИНАНСОВО-ПРАВНА ФОРМА",{"$f":"$E$15","v":98},{"$f":"$F$15","v":"СЕС - КСФ"},{"$nulls":6},{"$f":"(IF($E1292<>0,$M$2,IF($L1292<>0,$M$2,\"\")))","v":""}]
[822,{"$nulls":10},"(в лева)",{"$f":"(IF($E1292<>0,$M$2,IF($L1292<>0,$M$2,\"\")))","v":""}]
[823,null,null,"II.1. РАЗХОДИ ПО ДЕЙНОСТИ","Уточнен план 2020",{"$nulls":3},"Отчет 2020",{"$nulls":3},{"$f":"(IF($E1292<>0,$M$2,IF($L1292<>0,$M$2,\"\")))","v":""}]
[825,"§§","под-§§","НАИМЕНОВАНИЯ НА ПАРАГРАФИТЕ И ПОДПАРАГРАФИТЕ",{"$f":"$E$20","v":"Уточнен план                Общо"},{"$f":"$F$20","v":"държавни дейности"},{"$f":"$G$20","v":"местни дейности"},{"$f":"$H$20","v":"дофинансиране"},{"$f":"$I$20","v":"държавни дейности -ОТЧЕТ"},{"$f":"$J$20","v":"местни дейности - ОТЧЕТ"},{"$f":"$K$20","v":"дофинансиране - ОТЧЕТ"},{"$f":"$L$20","v":"ОТЧЕТ                                    ОБЩО"},{"$f":"(IF($E1292<>0,$M$2,IF($L1292<>0,$M$2,\"\")))","v":""}]
[{"$nulls":3}," 02 ¦",{"$f":"$E$21","v":"(1)"},{"$f":"$F$21","v":"(2)"},{"$f":"$G$21","v":"(3)"},{"$f":"$H$21","v":"(4)"},{"$f":"$I$21","v":"(5)"},{"$f":"$J$21","v":"(6)"},{"$f":"$K$21","v":"(7)"},{"$f":"$L$21","v":"(8)"},{"$f":"(IF($E1292<>0,$M$2,IF($L1292<>0,$M$2,\"\")))","v":""}]
[null,null,{"$f":"VLOOKUP(D1173,OP_LIST2,2,FALSE)","v":0},"ИЗБЕРЕТЕ ОПЕРАТИВНА ПРОГРАМА ",{"$nulls":8},{"$f":"(IF($E1292<>0,$M$2,IF($L1292<>0,$M$2,\"\")))","v":""}]
[null,null,{"$f":"VLOOKUP(D1175,EBK_DEIN2,2,FALSE)","v":3311},"<------          ДЕЙНОСТ    -  код  по  ЕБК",{"$nulls":8},{"$f":"(IF($E1292<>0,$M$2,IF($L1292<>0,$M$2,\"\")))","v":""}]
[null,null,{"$f":"+C1174","v":3311},"311 Детски градини",{"$nulls":8},{"$f":"(IF($E1292<>0,$M$2,IF($L1292<>0,$M$2,\"\")))","v":""}]
[{"$nulls":3},"(наименование на дейността)",{"$nulls":8},{"$f":"(IF($E1292<>0,$M$2,IF($L1292<>0,$M$2,\"\")))","v":""}]
[null,{"v":100,"d":"01-00"},"Заплати и възнаграждения за персонала, нает по трудови и служебни правоотношения",null,{"$f":"SUM(E1178:E1179)","v":0},0,0,{"$f":"SUM(H1178:H1179)","v":0},0,0,0,0,{"$f":"(IF($E1177<>0,$M$2,IF($L1177<>0,$M$2,\"\")))","v":""}]
[null,null,{"v":101,"d":"01-01"},"заплати и възнаграждения на персонала нает по трудови правоотношения",{"$f":"F1178+G1178+H1178","v":0},{"$nulls":6},{"$f":"I1178+J1178+K1178","v":0},{"$f":"(IF($E1178<>0,$M$2,IF($L1178<>0,$M$2,\"\")))","v":""}]
[null,null,{"v":102,"d":"01-02"},"заплати и възнаграждения на персонала нает по служебни правоотношения",{"$f":"F1179+G1179+H1179","v":0},{"$nulls":6},{"$f":"I1179+J1179+K1179","v":0},""]
[null,{"v":200,"d":"02-00"},"Други възнаграждения и плащания за персонала",null,{"$f":"SUM(E1181:E1185)","v":0},0,0,{"$f":"SUM(H1181:H1185)","v":0},0,0,0,0,""]
[null,null,{"v":201,"d":"02-01"},"за нещатен персонал нает по трудови правоотношения ",{"$f":"F1181+G1181+H1181","v":0},{"$nulls":6},{"$f":"I1181+J1181+K1181","v":0},""]
[null,null,{"v":202,"d":"02-02"},"за персонала по извънтрудови правоотношения",{"$f":"F1182+G1182+H1182","v":0},{"$nulls":6},{"$f":"I1182+J1182+K1182","v":0},""]
[null,null,{"v":205,"d":"02-05"},"изплатени суми от СБКО за облекло и други на персонала, с характер на възнаграждение",{"$f":"F1183+G1183+H1183","v":0},{"$nulls":6},{"$f":"I1183+J1183+K1183","v":0},""]
[null,null,{"v":208,"d":"02-08"},"обезщетения за персонала, с характер на възнаграждение",{"$f":"F1184+G1184+H1184","v":0},{"$nulls":6},{"$f":"I1184+J1184+K1184","v":0},""]
[null,null,{"v":209,"d":"02-09"},"другиплащания и възнаграждения",{"$f":"F1185+G1185+H1185","v":0},{"$nulls":6},{"$f":"I1185+J1185+K1185","v":0},""]
[null,{"v":500,"d":"05-00"},"Задължителни осигурителни вноски от работодатели",null,{"$f":"SUM(E1187:E1193)","v":0},0,0,{"$f":"SUM(H1187:H1193)","v":0},0,0,0,0,""]
[null,null,{"v":551,"d":"05-51"},"осигурителни вноски от работодатели за Държавното обществено осигуряване (ДОО)",{"$f":"F1187+G1187+H1187","v":0},{"$nulls":6},{"$f":"I1187+J1187+K1187","v":0},""]
[null,null,{"v":552,"d":"05-52"},"осигурителни вноски от работодатели за Учителския пенсионен фонд (УчПФ)",0,{"$nulls":6},0,""]
[null,null,{"v":558,"d":"05-58"},"вноски по чл. 4б и 4в от КСО за сметка на осигурителя",{"$f":"F1189+G1189+H1189","v":0},0,0,0,0,0,0,{"$f":"I1189+J1189+K1189","v":0},""]
[null,null,{"v":560,"d":"05-60"},"здравно-осигурителни вноски от работодатели",0,{"$nulls":6},0,""]
[null,null,{"v":580,"d":"05-80"},"вноски за допълнително задължително осигуряване от работодатели",0,{"$nulls":6},0,""]
[null,null,{"v":588,"d":"05-88"},"коректив на вноски за ДЗПО за сумите по чл. 4б и 4в от КСО за сметка на осигурителя",{"$f":"F1192+G1192+H1192","v":0},0,0,0,0,0,0,{"$f":"I1192+J1192+K1192","v":0},""]
[null,null,{"v":590,"d":"05-90"},"задължителни вноски за чуждестранни пенсионни фондове и  схеми за сметка на осигурителя",0,{"$nulls":6},0,""]
[5,{"v":800,"d":"08-00"},"Вноски за доброволно осигуряване  ",null,0,{"$nulls":6},0,""]
[10,{"v":1000,"d":"10-00"},"Издръжка",null,{"$f":"SUM(E1196:E1212)","v":0},0,0,{"$f":"SUM(H1196:H1212)","v":0},0,0,0,0,""]
[15,null,{"v":1011,"d":"10-11"},"Храна",{"$f":"F1196+G1196+H1196","v":0},{"$nulls":6},{"$f":"I1196+J1196+K1196","v":0},""]
[35,null,{"v":1012,"d":"10-12"},"Медикаменти",0,{"$nulls":6},0,""]
[40,null,{"v":1013,"d":"10-13"},"Постелен инвентар и облекло",0,{"$nulls":6},0,""]
[45,null,{"v":1014,"d":"10-14"},"Учебни и научно-изследователски разходи и книги за библиотеките",0,{"$nulls":6},0,""]
[50,null,{"v":1015,"d":"10-15"},"материали",0,{"$nulls":6},0,""]
[55,null,{"v":1016,"d":"10-16"},"вода, горива и енергия",0,{"$nulls":6},0,""]
[60,null,{"v":1020,"d":"10-20"},"разходи за външни услуги",0,{"$nulls":6},0,""]
[65,null,{"v":1030,"d":"10-30"},"Текущ ремонт",0,{"$nulls":6},0,""]
[70,null,{"v":1051,"d":"10-51"},"командировки в страната",0,{"$nulls":6},0,""]
[75,null,{"v":1052,"d":"10-52"},"краткосрочни командировки в чужбина",0,{"$nulls":6},0,""]
[80,null,{"v":1053,"d":"10-53"},"дългосрочни командировки в чужбина",0,{"$nulls":6},0,""]
[80,null,{"v":1062,"d":"10-62"},"разходи за застраховки",0,{"$nulls":6},0,""]
[85,null,{"v":1063,"d":"10-63"},"такса ангажимент по заеми",0,{"$nulls":6},0,""]
[90,null,{"v":1069,"d":"10-69"},"други финансови услуги",0,{"$nulls":6},0,""]
[90,null,{"v":1091,"d":"10-91"},"други разходи за СБКО",0,{"$nulls":6},0,""]
[115,null,{"v":1092,"d":"10-92"},"разходи за договорни санкции и неустойки, съдебни обезщетения и разноски",0,{"$nulls":6},0,""]
[125,null,{"v":1098,"d":"10-98"},"други разходи, некласифицирани в другите параграфи и подпараграфи",0,{"$nulls":6},0,""]
[130,{"v":1900,"d":"19-00"},"Платени данъци, такси и административни санкции",null,{"$f":"SUM(E1214:E1216)","v":0},0,0,{"$f":"SUM(H1214:H1216)","v":0},0,0,0,0,""]
[135,null,{"v":1901,"d":"19-01"},"платени държавни данъци, такси, наказателни лихви и административни санкции",{"$f":"F1214+G1214+H1214","v":0},{"$nulls":6},{"$f":"I1214+J1214+K1214","v":0},""]
[140,null,{"v":1981,"d":"19-81"},"платени общински данъци, такси, наказателни лихви и административни санкции",{"$f":"F1215+G1215+H1215","v":0},{"$nulls":6},{"$f":"I1215+J1215+K1215","v":0},""]
[145,null,{"v":1991,"d":"19-91"},"платени данъци, такси, наказателни лихви и административни санкции в чужбина",{"$f":"F1216+G1216+H1216","v":0},{"$nulls":6},{"$f":"I1216+J1216+K1216","v":0},""]
[150,{"v":2100,"d":"21-00"},"Разходи за лихви по емисии на държавни (общински) ценни книжа",null,{"$f":"SUM(E1218:E1222)","v":0},0,0,{"$f":"SUM(H1218:H1222)","v":0},0,0,0,0,""]
[155,null,{"v":2110,"d":"21-10"},"лихви по държавни (общински) ценни книжа",{"$f":"F1218+G1218+H1218","v":0},{"$nulls":6},{"$f":"I1218+J1218+K1218","v":0},""]
[160,null,{"v":2120,"d":"21-20"},"отстъпки по държавни (общински) ценни книжа",{"$f":"F1219+G1219+H1219","v":0},{"$nulls":6},{"$f":"I1219+J1219+K1219","v":0},""]
[165,null,{"v":2125,"d":"21-25"},"лихви и отстъпки по целеви емисии на държавни ценни книжа",{"$f":"F1220+G1220+H1220","v":0},0,0,0,0,0,0,{"$f":"I1220+J1220+K1220","v":0},""]
[175,null,{"v":2140,"d":"21-40"},"лихви по държавни ценни книжа, емитирани за структурната реформа ",{"$f":"F1221+G1221+H1221","v":0},0,0,0,0,0,0,{"$f":"I1221+J1221+K1221","v":0},""]
[180,null,{"v":2190,"d":"21-90"},"премии над номинала от емисии на държавни (общински) ценни книжа (-)",{"$f":"F1222+G1222+H1222","v":0},{"$nulls":6},{"$f":"I1222+J1222+K1222","v":0},""]
[185,{"v":2200,"d":"22-00"},"Разходи за лихви по заеми от страната",null,{"$f":"SUM(E1224:E1225)","v":0},0,0,{"$f":"SUM(H1224:H1225)","v":0},0,0,0,0,""]
[190,null,{"v":2221,"d":"22-21"},"Разходи за лихви по заеми от банки в страната",{"$f":"F1224+G1224+H1224","v":0},{"$nulls":6},{"$f":"I1224+J1224+K1224","v":0},""]
[200,null,{"v":2224,"d":"22-24"},"Разходи за лихви по други заеми от страната",0,{"$nulls":6},0,""]
[200,{"v":2500,"d":"25-00"},"Разходи за лихви по заеми от други държави",null,0,{"$nulls":6},0,""]
[205,{"v":2600,"d":"26-00"},"Разходи за лихви по заеми от международни организации и институции",null,0,{"$nulls":6},0,""]
[210,{"v":2700,"d":"27-00"},"Разходи за лихви по заеми от банки и други финансови институции от чужбина",null,0,{"$nulls":6},0,""]
[215,{"v":2800,"d":"28-00"},"Разходи за лихви и отстъпки по облигации, емитирани и търгувани на международните капиталови пазари",null,0,{"$nulls":6},0,""]
[220,{"v":2900,"d":"29-00"},"Други разходи за лихви",null,{"$f":"SUM(E1231:E1238)","v":0},{"$f":"SUM(F1231:F1238)","v":0},{"$f":"SUM(G1231:G1238)","v":0},0,0,0,0,0,""]
[225,null,{"v":2910,"d":"29-10"},"Платени лихви по финансов лизинг и търговски кредит",{"$f":"F1231+G1231+H1231","v":0},{"$nulls":6},{"$f":"I1231+J1231+K1231","v":0},""]
[230,null,{"v":2920,"d":"29-20"},"Платени лихви по активирани гаранции по заеми от  банки в страната",{"$f":"F1232+G1232+H1232","v":0},{"$nulls":6},{"$f":"I1232+J1232+K1232","v":0},""]
[245,null,{"v":2969,"d":"29-69"},"Платени лихви по активирани гаранции по заеми от международни организации и институции",0,{"$nulls":6},0,""]
[220,null,{"v":2970,"d":"29-70"},"Платени лихви по активирани гаранции по заеми от банки и финансови институции от чужбина",0,{"$nulls":6},0,""]
[225,null,{"v":2989,"d":"29-89"},"Възстановени суми по платени лихви по активирани гаранции (-)",0,{"$nulls":6},0,""]
[230,null,{"v":2990,"d":"29-90"},"Платени лихви по активирани гаранции по заеми от  банки в страната",{"$f":"F1236+G1236+H1236","v":0},{"$nulls":6},{"$f":"I1236+J1236+K1236","v":0},""]
[235,null,{"v":2991,"d":"29-91"},"Други разходи за лихви към  местни лица",0,{"$nulls":6},0,""]
[240,null,{"v":2992,"d":"29-92"},"Други разходи за лихви към чуждестранни лица",0,{"$nulls":6},0,""]
[245,{"v":3300,"d":"33-00"},"Вноска в общия бюджет на Европейския съюз",null,{"$f":"SUM(E1240:E1244)","v":0},0,0,0,0,0,0,0,""]
[250,null,{"v":3301,"d":"33-01"},"ресурс на база брутен национален доход",{"$f":"F1240+G1240+H1240","v":0},0,0,0,0,0,0,{"$f":"I1240+J1240+K1240","v":0},""]
[255,null,{"v":3302,"d":"33-02"},"ресурс на база данък върху добавената стойност",0,0,0,0,0,0,0,0,""]
[265,null,{"v":3303,"d":"33-03"},"корекция за Обединеното кралство",0,0,0,0,0,0,0,0,""]
[270,null,{"v":3304,"d":"33-04"},"традиционни собствени ресурси - мита",0,0,0,0,0,0,0,0,""]
[290,null,{"v":3306,"d":"33-06"},"участие във финансирането на брутното намаление за Нидерландия, Швеция, Дания и Австрия",0,0,0,0,0,0,0,0,""]
[320,{"v":3900,"d":"39-00"},"Здравно-осигурителни плащания",null,0,0,0,0,0,0,0,0,{"$f":"(IF($E1245<>0,$M$2,IF($L1245<>0,$M$2,\"\")))","v":""}]
[330,{"v":4000,"d":"40-00"},"Стипендии",null,0,{"$nulls":6},0,""]
[350,{"v":4100,"d":"41-00"},"Пенсии",null,0,0,0,0,0,0,0,0,""]
[355,{"v":4200,"d":"42-00"},"Текущи трансфери, обезщетения и помощи за домакинствата",null,{"$f":"SUM(E1249:E1254)","v":0},0,0,{"$f":"SUM(H1249:H1254)","v":0},0,0,0,0,""]
[355,null,{"v":4201,"d":"42-01"},"обезщетения и помощи по социалното осигуряване",{"$f":"F1249+G1249+H1249","v":0},{"$nulls":6},{"$f":"I1249+J1249+K1249","v":0},""]
[375,null,{"v":4202,"d":"42-02"},"обезщетения и помощи по социалното подпомагане",0,{"$nulls":6},0,""]
[380,null,{"v":4214,"d":"42-14"},"обезщетения и помощи по решение на общинския съвет",0,{"$nulls":6},0,""]
[385,null,{"v":4217,"d":"42-17"},"текущи трансфери за домакинства от средства на Европейския съюз",0,{"$nulls":6},0,""]
[390,null,{"v":4218,"d":"42-18"},"текущи трансфери за домакинства по други международни програми и споразумения",0,{"$nulls":6},0,""]
[390,null,{"v":4219,"d":"42-19"},"други текущи трансфери за домакинствата",0,{"$nulls":6},0,""]
[395,{"v":4300,"d":"43-00"},"Субсидии и други текущи трансфери за нефинансови предприятия",null,{"$f":"SUM(E1256:E1258)","v":0},0,0,{"$f":"SUM(H1256:H1258)","v":0},0,0,0,0,""]
[397,null,{"v":4301,"d":"43-01"},"за текуща дейност",{"$f":"F1256+G1256+H1256","v":0},{"$nulls":6},{"$f":"I1256+J1256+K1256","v":0},""]
[398,null,{"v":4302,"d":"43-02"},"за осъществяване на болнична помощ ",0,{"$nulls":6},0,""]
[399,null,{"v":4309,"d":"43-09"},"други субсидии и плащания",0,{"$nulls":6},0,""]
[400,{"v":4400,"d":"44-00"},"Субсидии и други текущи трансфери за финансови институции",null,0,{"$nulls":6},0,""]
[401,{"v":4500,"d":"45-00"},"Субсидии и други текущи трансфери за юридически лица с нестопанска цел",null,0,{"$nulls":6},0,""]
[404,{"v":4600,"d":"46-00"},"Разходи за членски внос и участие в нетърговски организации и дейности",null,0,{"$nulls":6},0,""]
[404,{"v":4900,"d":"49-00"},"Предоставени текущи и капиталови трансфери за чужбина",null,{"$f":"+E1263+E1264","v":0},0,0,{"$f":"+H1263+H1264","v":0},0,0,0,0,""]
[440,null,{"v":4901,"d":"49-01"},"текущи трансфери за чужбина",{"$f":"F1263+G1263+H1263","v":0},{"$nulls":6},{"$f":"I1263+J1263+K1263","v":0},""]
[450,null,{"v":4902,"d":"49-02"},"капиталови трансфери за чужбина",{"$f":"F1264+G1264+H1264","v":0},{"$nulls":6},{"$f":"I1264+J1264+K1264","v":0},""]
[495,{"v":5100,"d":"51-00"},"Основен ремонт на дълготрайни материални активи",null,{"$f":"F1265+G1265+H1265","v":0},{"$nulls":6},{"$f":"I1265+J1265+K1265","v":0},""]
[500,{"v":5200,"d":"52-00"},"Придобиване на дълготрайни материални активи",null,{"$f":"SUM(E1267:E1273)","v":0},0,0,{"$f":"SUM(H1267:H1273)","v":0},0,0,0,0,""]
[505,null,{"v":5201,"d":"52-01"},"придобиване на компютри и хардуер",{"$f":"F1267+G1267+H1267","v":0},{"$nulls":6},{"$f":"I1267+J1267+K1267","v":0},""]
[510,null,{"v":5202,"d":"52-02"},"придобиване на сгради",0,{"$nulls":6},0,""]
[515,null,{"v":5203,"d":"52-03"},"придобиване на друго оборудване, машини и съоръжения",0,{"$nulls":6},0,""]
[520,null,{"v":5204,"d":"52-04"},"придобиване на транспортни средства",0,{"$nulls":6},0,""]
[525,null,{"v":5205,"d":"52-05"},"придобиване на стопански инвентар",0,{"$nulls":6},0,""]
[635,null,{"v":5206,"d":"52-06"},"изграждане на инфраструктурни обекти",0,{"$nulls":6},0,""]
[640,null,{"v":5219,"d":"52-19"},"придобиване на други ДМА",0,{"$nulls":6},0,""]
[645,{"v":5300,"d":"53-00"},"Придобиване на нематериални дълготрайни активи",null,{"$f":"SUM(E1275:E1276)","v":0},0,0,{"$f":"SUM(H1275:H1276)","v":0},0,0,0,0,""]
[650,null,{"v":5301,"d":"53-01"},"придобиване на програмни продукти и лицензи за програмни продукти",{"$f":"F1275+G1275+H1275","v":0},{"$nulls":6},{"$f":"I1275+J1275+K1275","v":0},""]
[655,null,{"v":5309,"d":"53-09"},"придобиване на други нематериални дълготрайни активи",{"$f":"F1276+G1276+H1276","v":0},{"$nulls":6},{"$f":"I1276+J1276+K1276","v":0},""]
[665,{"v":5400,"d":"54-00"},"Придобиване на земя",null,{"$f":"F1277+G1277+H1277","v":0},{"$nulls":6},{"$f":"I1277+J1277+K1277","v":0},""]
[675,{"v":5500,"d":"55-00"},"Капиталови трансфери",null,{"$f":"SUM(E1279:E1282)","v":0},0,0,{"$f":"SUM(H1279:H1282)","v":0},0,0,0,0,""]
[685,null,{"v":5501,"d":"55-01"},"капиталови трансфери за нефинансови предприятия",{"$f":"F1279+G1279+H1279","v":0},{"$nulls":6},{"$f":"I1279+J1279+K1279","v":0},""]
[690,null,{"v":5502,"d":"55-02"},"капиталови трансфери за финансови институции",{"$f":"F1280+G1280+H1280","v":0},{"$nulls":6},{"$f":"I1280+J1280+K1280","v":0},""]
[695,null,{"v":5503,"d":"55-03"},"капиталови трансфери за организации с нестопанска цел",{"$f":"F1281+G1281+H1281","v":0},{"$nulls":6},{"$f":"I1281+J1281+K1281","v":0},""]
[700,null,{"v":5504,"d":"55-04"},"капиталови трансфери за домакинствата",{"$f":"F1282+G1282+H1282","v":0},{"$nulls":6},{"$f":"I1282+J1282+K1282","v":0},""]
[710,{"v":5700,"d":"57-00"},"Прираст на държавния резерв и изкупуване на земеделска продукция (включва и § 40-71)",null,{"$f":"SUM(E1284:E1286)","v":0},0,0,0,0,0,0,{"$f":"SUM(L1284:L1286)","v":0},""]
[715,null,{"v":5701,"d":"57-01"},"плащания за попълване на държавния резерв",{"$f":"F1284+G1284+H1284","v":0},0,0,0,0,0,0,{"$f":"I1284+J1284+K1284","v":0},""]
[720,null,{"v":5702,"d":"57-02"},"плащания за изкупуване на земеделска продукция",{"$f":"F1285+G1285+H1285","v":0},0,0,0,0,0,0,{"$f":"I1285+J1285+K1285","v":0},""]
[725,null,{"v":4071,"d":"40-71"},"постъпления от продажба на държавния резерв (-)",{"$f":"F1286+G1286+H1286","v":0},0,0,0,0,0,0,{"$f":"I1286+J1286+K1286","v":0},""]
[730,null,"Резерв за непредвидени и неотложни разходи",{"$nulls":9},""]
[735,{"v":98,"d":"00-98"},"Резерв за непредвидени и неотложни разходи",null,{"$f":"F1288+G1288+H1288","v":0},{"$nulls":3},0,0,0,{"$f":"I1288+J1288+K1288","v":0},""]
[740,{"$nulls":11},""]
[745,{"$nulls":11},""]
[750,{"$nulls":11},""]
[755,null,"99-99",{"$f":"+B1292","v":{"v":0,"d":"II. ОБЩО РАЗХОДИ ЗА ДЕЙНОСТ 0000"}},{"$f":"SUM(E1177,E1180,E1186,E1194,E1195,E1213,E1217,E1223,E1226,E1227,E1228,E1229,E1230,E1239,E1245,E1246,E1247,E1248,E1255,E1259,E1260,E1261,E1262,E1265,E1266,E1274,E1277,E1278,E1283)+E1288","v":0},0,0,0,0,0,0,0,{"$f":"(IF($E1292<>0,$M$2,IF($L1292<>0,$M$2,\"\")))","v":""},{"$f":"LEFT(C1174,1)","v":"3"}]
[760,"край на дейност",{"$nulls":10},{"$f":"(IF($E1292<>0,$M$2,IF($L1292<>0,$M$2,\"\")))","v":""}]
[765,{"$nulls":11},{"$f":"(IF($E1292<>0,$M$2,IF($L1292<>0,$M$2,\"\")))","v":""}]
[775,{"$nulls":11},{"$f":"(IF(E1290<>0,$G$2,IF(L1290<>0,$G$2,\"\")))","v":""}]
[780,{"$nulls":11},{"$f":"(IF(E1291<>0,$G$2,IF(L1291<>0,$G$2,\"\")))","v":""}]
[785]
[790]
[795]
[805]
[810]
[815]
[525]
[820]
[821]
[822]
[823]
[825]
{"$rows_empty":15}
[905]
[906]
[]
[907]

{"sheet":"list","index":3,"n_rows":725,"n_cols":3,"rows_kept":725,"hidden":true}
["Name:","SMETKA"]
[0,"ОТЧЕТНИ ДАННИ ПО ЕБК ЗА ИЗПЪЛНЕНИЕТО НА БЮДЖЕТА","                                  ОТЧЕТ ЗА КАСОВОТО ИЗПЪЛНЕНИЕ НА БЮДЖЕТА"]
[33,"ОТЧЕТНИ ДАННИ ПО ЕБК ЗА СМЕТКИТЕ ЗА ЧУЖДИ СРЕДСТВА","                   ОТЧЕТ ЗА КАСОВОТО ИЗПЪЛНЕНИЕ НА СМЕТКИТЕ ЗА ЧУЖДИ СРЕДСТВА"]
[42,"ОТЧЕТНИ ДАННИ ПО ЕБК ЗА СМЕТКИТЕ ЗА СРЕДСТВАТА ОТ ЕВРОПЕЙСКИЯ СЪЮЗ - РА","ОТЧЕТ ЗА КАСОВОТО ИЗПЪЛНЕНИЕ НА СМЕТКИТЕ ЗА СРЕДСТВАТА ОТ ЕВРОПЕЙСКИЯ СЪЮЗ - РА"]
[96,"ОТЧЕТНИ ДАННИ ПО ЕБК ЗА СМЕТКИТЕ ЗА СРЕДСТВАТА ОТ ЕВРОПЕЙСКИЯ СЪЮЗ - ДЕС","ОТЧЕТ ЗА КАСОВОТО ИЗПЪЛНЕНИЕ НА СМЕТКИТЕ ЗА СРЕДСТВАТА ОТ ЕВРОПЕЙСКИЯ СЪЮЗ - ДЕС"]
[97,"ОТЧЕТНИ ДАННИ ПО ЕБК ЗА СМЕТКИТЕ ЗА СРЕДСТВАТА ОТ ЕВРОПЕЙСКИЯ СЪЮЗ - ДМП","ОТЧЕТ ЗА КАСОВОТО ИЗПЪЛНЕНИЕ НА СМЕТКИТЕ ЗА СРЕДСТВАТА ОТ ЕВРОПЕЙСКИЯ СЪЮЗ - ДМП"]
[98,"ОТЧЕТНИ ДАННИ ПО ЕБК ЗА СМЕТКИТЕ ЗА СРЕДСТВАТА ОТ ЕВРОПЕЙСКИЯ СЪЮЗ - КСФ","ОТЧЕТ ЗА КАСОВОТО ИЗПЪЛНЕНИЕ НА СМЕТКИТЕ ЗА СРЕДСТВАТА ОТ ЕВРОПЕЙСКИЯ СЪЮЗ - КСФ"]
[]
[]
["Name:","\"EBK_DEIN\" и \"EBK_DEIN2\""]
[null,"ИЗБЕРЕТЕ ДЕЙНОСТ"]
[{"v":1101,"d":"11 0 1"},"101 Централни държавни органи",{"v":1101,"d":"11 0 1"}]
[{"v":1103,"d":"11 0 3"},"103 Централни държавни органи по образованието",{"v":1103,"d":"11 0 3"}]
[{"v":1104,"d":"11 0 4"},"104 Централни държавни органи по здравеопазването",{"v":1104,"d":"11 0 4"}]
[{"v":1105,"d":"11 0 5"},"105 Централни държавни органи по социалното осигуряването",{"v":1105,"d":"11 0 5"}]
[{"v":1106,"d":"11 0 6"},"106 Централни държавни органи по регионалното развитие и благоустройство",{"v":1106,"d":"11 0 6"}]
[{"v":1107,"d":"11 0 7"},"107 Централни държавни органи по културата и спорта",{"v":1107,"d":"11 0 7"}]
[{"v":1108,"d":"11 0 8"},"108 Централни държавни органи по икономическите дейности и услуги",{"v":1108,"d":"11 0 8"}]
[{"v":1111,"d":"11 1 1"},"111 Контролни органи",{"v":1111,"d":"11 1 1"}]
[{"v":1115,"d":"11 1 5"},"115 Управление, контрол и регулиране на външните работи",{"v":1115,"d":"11 1 5"}]
[{"v":1116,"d":"11 1 6"},"116 Посолства, консулства, представителства и мисии в чужбина",{"v":1116,"d":"11 1 6"}]
[{"v":1117,"d":"11 1 7"},"117 Държавни и общински служби и дейности по изборите",{"v":1117,"d":"11 1 7"}]
[{"v":1121,"d":"11 2 1"},"121 Областни администрации",{"v":1121,"d":"11 2 1"}]
[{"v":1122,"d":"11 2 2"},"122 Общинска администрация",{"v":1122,"d":"11 2 2"}]
[{"v":1123,"d":"11 2 3"},"123 Общински съвети ",{"v":1123,"d":"11 2 3"}]
[{"v":1125,"d":"11 2 5"},"125 Членове на Европейския парламент от Република България",{"v":1125,"d":"11 2 5"}]
[{"v":1128,"d":"11 2 8"},"128 Международни програми и споразумения, дарения и помощи от чужбина",{"v":1128,"d":"11 2 8"}]
[{"v":1139,"d":"11 3 9"},"139 Други изпълнителни и законодателни органи",{"v":1139,"d":"11 3 9"}]
[{"v":1141,"d":"11 4 1"},"141 Статистически институт,служби и дейности,социологически проучвания и анкети",{"v":1141,"d":"11 4 1"}]
[{"v":1142,"d":"11 4 2"},"142 Общоикономическо и социално програмиране и прогнозиране",{"v":1142,"d":"11 4 2"}]
[{"v":1143,"d":"11 4 3"},"143 Регистрация и контрол на чуждестранните инвестиции",{"v":1143,"d":"11 4 3"}]
[{"v":1144,"d":"11 4 4"},"144 Служби и дейности за връзки с българите в чужбина",{"v":1144,"d":"11 4 4"}]
[{"v":1145,"d":"11 4 5"},"145 Служби и дейности за подпомагане на бежанците",{"v":1145,"d":"11 4 5"}]
[{"v":1146,"d":"11 4 6"},"146 Управление и администриране на получена чуждестранна помощ",{"v":1146,"d":"11 4 6"}]
[{"v":1147,"d":"11 4 7"},"147 Управление на държавния резерв и военновременните запаси",{"v":1147,"d":"11 4 7"}]
[{"v":1148,"d":"11 4 8"},"148 Управление на гражд.администрация и административнообслужване на населението",{"v":1148,"d":"11 4 8"}]
[{"v":1149,"d":"11 4 9"},"149 Други общи служби",{"v":1149,"d":"11 4 9"}]
[{"v":1151,"d":"11 5 1"},"151 Ликвидационна комисия за закрити бюджетни организации",{"v":1151,"d":"11 5 1"}]
[{"v":1158,"d":"11 5 8"},"158 Международни програми и споразумения, дарения и помощи от чужбина",{"v":1158,"d":"11 5 8"}]
[{"v":1161,"d":"11 6 1"},"161 Организация и управление на научните изследвания и дейности",{"v":1161,"d":"11 6 1"}]
[{"v":1162,"d":"11 6 2"},"162 Научноизследователско дело",{"v":1162,"d":"11 6 2"}]
[{"v":1163,"d":"11 6 3"},"163 Научноизследователски институти и центрове",{"v":1163,"d":"11 6 3"}]
[{"v":1168,"d":"11 6 8"},"168 Международни програми и споразумения, дарения и помощи от чужбина",{"v":1168,"d":"11 6 8"}]
[{"v":1179,"d":"11 7 9"},"179 Други дейности на науката",{"v":1179,"d":"11 7 9"}]
[{"v":2201,"d":"22 0 1"},"201 Дейности по отбраната",{"v":2201,"d":"22 0 1"}]
[{"v":2205,"d":"22 0 5"},"205 Участие на Република България в НАТО",{"v":2205,"d":"22 0 5"}]
[{"v":2206,"d":"22 0 6"},"206 Мироопазващи мисии в чужбина",{"v":2206,"d":"22 0 6"}]
[{"v":2215,"d":"22 1 5"},"215 Приложни научни изследвания в областта на отбраната",{"v":2215,"d":"22 1 5"}]
[{"v":2218,"d":"22 1 8"},"218 Международни програми и споразумения, дарения и помощи от чужбина",{"v":2218,"d":"22 1 8"}]
[{"v":2219,"d":"22 1 9"},"219 Други дейности по отбраната",{"v":2219,"d":"22 1 9"}]
[{"v":2221,"d":"22 2 1"},"221 Полиция и вътрешен ред",{"v":2221,"d":"22 2 1"}]
[{"v":2222,"d":"22 2 2"},"222 Национална служба за охрана",{"v":2222,"d":"22 2 2"}]
[{"v":2223,"d":"22 2 3"},"223 Държавна агенция \"Разузнаване\"",{"v":2223,"d":"22 2 3"}]
[{"v":2224,"d":"22 2 4"},"224 Противопожарна охрана",{"v":2224,"d":"22 2 4"}]
[{"v":2225,"d":"22 2 5"},"225 Приложни научни изследвания в областта на вътрешния ред и сигурност",{"v":2225,"d":"22 2 5"}]
[{"v":2228,"d":"22 2 8"},"228 Международни програми и споразумения, дарения и помощи от чужбина",{"v":2228,"d":"22 2 8"}]
[{"v":2239,"d":"22 3 9"},"239 Други дейности по вътрешната сигурност",{"v":2239,"d":"22 3 9"}]
[{"v":2241,"d":"22 4 1"},"241 Висш съдебен съвет",{"v":2241,"d":"22 4 1"}]
[{"v":2242,"d":"22 4 2"},"242 Върховен административен съд",{"v":2242,"d":"22 4 2"}]
[{"v":2243,"d":"22 4 3"},"243 Върховен касационен съд",{"v":2243,"d":"22 4 3"}]
[{"v":2244,"d":"22 4 4"},"244 Прокуратура",{"v":2244,"d":"22 4 4"}]
[{"v":2245,"d":"22 4 5"},"245 Национална следствена служба",{"v":2245,"d":"22 4 5"}]
[{"v":2246,"d":"22 4 6"},"246 Съдилища",{"v":2246,"d":"22 4 6"}]
[{"v":2247,"d":"22 4 7"},"247 Окръжни следствени служби",{"v":2247,"d":"22 4 7"}]
[{"v":2248,"d":"22 4 8"},"248 Инспекторат към Висшия съдебен съвет",{"v":2248,"d":"22 4 8"}]
[{"v":2249,"d":"22 4 9"},"249 Национален институт на правосъдието",{"v":2249,"d":"22 4 9"}]
[{"v":2258,"d":"22 5 8"},"258 Международни програми и споразумения, дарения и помощи от чужбина",{"v":2258,"d":"22 5 8"}]
[{"v":2259,"d":"22 5 9"},"259 Други дейности на съдебната власт",{"v":2259,"d":"22 5 9"}]
[{"v":2261,"d":"22 6 1"},"261 Места за лишаване от свобода",{"v":2261,"d":"22 6 1"}]
[{"v":2268,"d":"22 6 8"},"268 Международни програми и споразумения, дарения и помощи от чужбина",{"v":2268,"d":"22 6 8"}]
[{"v":2279,"d":"22 7 9"},"279 Други дейности на администрацията на затворите",{"v":2279,"d":"22 7 9"}]
[{"v":2281,"d":"22 8 1"},"281 Неотложна дейност по защита на населението и националното стопанство",{"v":2281,"d":"22 8 1"}]
[{"v":2282,"d":"22 8 2"},"282 Отбранително-мобилизационна подготовка, поддържане на запаси и мощности",{"v":2282,"d":"22 8 2"}]
[{"v":2283,"d":"22 8 3"},"283 Превантивна дейност за намаляване на вредните последствия от бедствия и аварии",{"v":2283,"d":"22 8 3"}]
[{"v":2284,"d":"22 8 4"},"284 Ликвидиране на последици от стихийни бедствия и производствени аварии",{"v":2284,"d":"22 8 4"}]
[{"v":2285,"d":"22 8 5"},"285 Доброволни формирования за защита при бедствия",{"v":2285,"d":"22 8 5"}]
[{"v":2288,"d":"22 8 8"},"288 Международни програми и споразумения, дарения и помощи от чужбина",{"v":2288,"d":"22 8 8"}]
[{"v":2289,"d":"22 8 9"},"289 Други дейности за защита на населението при стихийни бедствия и аварии",{"v":2289,"d":"22 8 9"}]
[{"v":3301,"d":"33 0 1"},"301 Управление, контрол, регулиране и лицензиране на дейности по образованието",{"v":3301,"d":"33 0 1"}]
[{"v":3311,"d":"33 1 1"},"311 Детски градини",{"v":3311,"d":"33 1 1"}]
[{"v":3312,"d":"33 1 2"},"312 Специални групи в детски градини за деца със СОП",{"v":3312,"d":"33 1 2"}]
[{"v":3318,"d":"33 1 8"},"318 Подготвителна група в училище",{"v":3318,"d":"33 1 8"}]
[{"v":3321,"d":"33 2 1"},"321 Специални училища и центрове за специална образователна подкрепа",{"v":3321,"d":"33 2 1"}]
[{"v":3322,"d":"33 2 2"},"322 Неспециализирани училища, без професионални гимназии",{"v":3322,"d":"33 2 2"}]
[{"v":3323,"d":"33 2 3"},"323 Училища по културата и училища по изкуствата",{"v":3323,"d":"33 2 3"}]
[{"v":3324,"d":"33 2 4"},"324 Спортни училища",{"v":3324,"d":"33 2 4"}]
[{"v":3325,"d":"33 2 5"},"325 Български училища в чужбина",{"v":3325,"d":"33 2 5"}]
[{"v":3326,"d":"33 2 6"},"326 Професионални гимназии и паралелки за професионална подготовка",{"v":3326,"d":"33 2 6"}]
[{"v":3327,"d":"33 2 7"},"327 Училища в места за лишаване от свобода",{"v":3327,"d":"33 2 7"}]
[{"v":3332,"d":"33 3 2"},"332 Общежития",{"v":3332,"d":"33 3 2"}]
[{"v":3333,"d":"33 3 3"},"333 Ученически почивни лагери",{"v":3333,"d":"33 3 3"}]
[{"v":3334,"d":"33 3 4"},"334 Повишаване на квалификацията",{"v":3334,"d":"33 3 4"}]
[{"v":3336,"d":"33 3 6"},"336 Столове",{"v":3336,"d":"33 3 6"}]
[{"v":3337,"d":"33 3 7"},"337 Център за подкрепа за личностно развитие",{"v":3337,"d":"33 3 7"}]
[{"v":3338,"d":"33 3 8"},"338 Ресурсно подпомагане",{"v":3338,"d":"33 3 8"}]
[{"v":3341,"d":"33 4 1"},"341 Академии, университети и висши училища",{"v":3341,"d":"33 4 1"}]
[{"v":3349,"d":"33 4 9"},"349 Приложни научни изследвания в областта на образованието",{"v":3349,"d":"33 4 9"}]
[{"v":3359,"d":"33 5 9"},"359 Други дейности за децата",{"v":3359,"d":"33 5 9"}]
[{"v":3369,"d":"33 6 9"},"369 Други дейности за младежта",{"v":3369,"d":"33 6 9"}]
[{"v":3388,"d":"33 8 8"},"388 Международни програми и споразумения, дарения и помощи от чужбина",{"v":3388,"d":"33 8 8"}]
[{"v":3389,"d":"33 8 9"},"389 Други дейности по образованието",{"v":3389,"d":"33 8 9"}]
[{"v":4401,"d":"44 0 1"},"401 Управление, контрол и регулиране на дейности по здравеопазването",{"v":4401,"d":"44 0 1"}]
[{"v":4412,"d":"44 1 2"},"412 Многопрофилни болници за активно лечение ",{"v":4412,"d":"44 1 2"}]
[{"v":4415,"d":"44 1 5"},"415 Домове за медико-социални грижи ",{"v":4415,"d":"44 1 5"}]
[{"v":4418,"d":"44 1 8"},"418 Психиатрични болници",{"v":4418,"d":"44 1 8"}]
[{"v":4429,"d":"44 2 9"},"429 Центрове за спешна медицинска помощ",{"v":4429,"d":"44 2 9"}]
[{"v":4431,"d":"44 3 1"},"431 Детски ясли, детски кухни и яслени групи в детска градина",{"v":4431,"d":"44 3 1"}]
[{"v":4433,"d":"44 3 3"},"433 Рехабилитация",{"v":4433,"d":"44 3 3"}]
[{"v":4436,"d":"44 3 6"},"436 Национални центрове",{"v":4436,"d":"44 3 6"}]
[{"v":4437,"d":"44 3 7"},"437 Здравен кабинет в детски градини и училища",{"v":4437,"d":"44 3 7"}]
[{"v":4448,"d":"44 4 8"},"448 Центрове за комплексно обслужване на деца с увреждания и хронични заболявания",{"v":4448,"d":"44 4 8"}]
[{"v":4450,"d":"44 5 0"},"450 Преобразувани лечебни заведения",{"v":4450,"d":"44 5 0"}]
[{"v":4451,"d":"44 5 1"},"451 Плащания за първична извънболнична медицинска помощ",{"v":4451,"d":"44 5 1"}]
[{"v":4452,"d":"44 5 2"},"452 Плащания за специализирана извънболнична медицинска помощ",{"v":4452,"d":"44 5 2"}]
[{"v":4453,"d":"44 5 3"},"453 Плащания за дентална помощ",{"v":4453,"d":"44 5 3"}]
[{"v":4454,"d":"44 5 4"},"454 Плащания за медико-диагностична дейност",{"v":4454,"d":"44 5 4"}]
[{"v":4455,"d":"44 5 5"},"455 Плащания за лекарствени продукти, медицински изделия и диетични храни за специални медицински цели за домашно лечение на територията на страната",{"v":4455,"d":"44 5 5"}]
[{"v":4456,"d":"44 5 6"},"456 Плащания за болнична медицинска помощ",{"v":4456,"d":"44 5 6"}]
[{"v":4457,"d":"44 5 7"},"457 Плащания за медицински изделия прилагани в болничната медицинска помощ",{"v":4457,"d":"44 5 7"}]
[{"v":4458,"d":"44 5 8"},"458 Плащания за лекарствени продукти в условия на болнична медицинска помощ",{"v":4458,"d":"44 5 8"}]
[{"v":4459,"d":"44 5 9"},"459 Други здравноосигурителни плащания",{"v":4459,"d":"44 5 9"}]
[{"v":4465,"d":"44 6 5"},"465 Приложни научни изследвания в областта на здравеопазването",{"v":4465,"d":"44 6 5"}]
[{"v":4467,"d":"44 6 7"},"467 Национални програми",{"v":4467,"d":"44 6 7"}]
[{"v":4468,"d":"44 6 8"},"468 Международни програми и споразумения, дарения и помощи от чужбина",{"v":4468,"d":"44 6 8"}]
[{"v":4469,"d":"44 6 9"},"469 Други дейности по здравеопазването",{"v":4469,"d":"44 6 9"}]
[{"v":5501,"d":"55 0 1"},"501 Пенсии",{"v":5501,"d":"55 0 1"}]
[{"v":5511,"d":"55 1 1"},"511 Помощи по Закона за семейните помощи за деца",{"v":5511,"d":"55 1 1"}]
[{"v":5512,"d":"55 1 2"},"512 Помощи по Закона за социално подпомагане",{"v":5512,"d":"55 1 2"}]
[{"v":5513,"d":"55 1 3"},"513 Помощи по Закона за хората с увреждания",{"v":5513,"d":"55 1 3"}]
[{"v":5514,"d":"55 1 4"},"514 Помощи за диагностика и лечение на социално слаби лица",{"v":5514,"d":"55 1 4"}]
[{"v":5515,"d":"55 1 5"},"515 Помощи по Закона за закрила на детето",{"v":5515,"d":"55 1 5"}]
[{"v":5516,"d":"55 1 6"},"516 Помощи по Закона за ветераните от войните на Република България",{"v":5516,"d":"55 1 6"}]
[{"v":5517,"d":"55 1 7"},"517 Помощи по Закона за военноинвалидите и военнопострадалите",{"v":5517,"d":"55 1 7"}]
[{"v":5518,"d":"55 1 8"},"518 Социални помощи и обезщетения по международни програми, помощи и дарения",{"v":5518,"d":"55 1 8"}]
[{"v":5519,"d":"55 1 9"},"519 Други помощи и обезщетения",{"v":5519,"d":"55 1 9"}]
[{"v":5521,"d":"55 2 1"},"521 Служби по социалното осигуряване (ДОО и др.)",{"v":5521,"d":"55 2 1"}]
[{"v":5522,"d":"55 2 2"},"522 Дирекции за социално подпомагане",{"v":5522,"d":"55 2 2"}]
[{"v":5524,"d":"55 2 4"},"524 Домашен социален патронаж",{"v":5524,"d":"55 2 4"}]
[{"v":5525,"d":"55 2 5"},"525 Клубове на пенсионера, инвалида и др.",{"v":5525,"d":"55 2 5"}]
[{"v":5526,"d":"55 2 6"},"526 Центрове за обществена подкрепа",{"v":5526,"d":"55 2 6"}]
[{"v":5527,"d":"55 2 7"},"527 Звена \"Майка и бебе\"",{"v":5527,"d":"55 2 7"}]
[{"v":5528,"d":"55 2 8"},"528 Център за работа с деца на улицата",{"v":5528,"d":"55 2 8"}]
[{"v":5529,"d":"55 2 9"},"529 Кризисен център",{"v":5529,"d":"55 2 9"}]
[{"v":5530,"d":"55 3 0"},"530 Център за настаняване от семеен тип",{"v":5530,"d":"55 3 0"}]
[{"v":5531,"d":"55 3 1"},"531 Дейности за предотвратяване на трудови злополуки и професионални болести",{"v":5531,"d":"55 3 1"}]
[{"v":5532,"d":"55 3 2"},"532 Програми за временна заетост",{"v":5532,"d":"55 3 2"}]
[{"v":5533,"d":"55 3 3"},"533 Други програми и дейности за осигуряване на заетост",{"v":5533,"d":"55 3 3"}]
[{"v":5534,"d":"55 3 4"},"534 Наблюдавани жилища",{"v":5534,"d":"55 3 4"}]
[{"v":5535,"d":"55 3 5"},"535 Преходни жилища",{"v":5535,"d":"55 3 5"}]
[{"v":5538,"d":"55 3 8"},"538 Програми за закрила на детето",{"v":5538,"d":"55 3 8"}]
[{"v":5540,"d":"55 4 0"},"540 Домове за стари хора",{"v":5540,"d":"55 4 0"}]
[{"v":5541,"d":"55 4 1"},"541 Домове за възрастни хора с увреждания",{"v":5541,"d":"55 4 1"}]
[{"v":5545,"d":"55 4 5"},"545 Социален учебно-професионален център",{"v":5545,"d":"55 4 5"}]
[{"v":5546,"d":"55 4 6"},"546 Домове за деца",{"v":5546,"d":"55 4 6"}]
[{"v":5547,"d":"55 4 7"},"547 Център за временно настаняване",{"v":5547,"d":"55 4 7"}]
[{"v":5548,"d":"55 4 8"},"548 Дневни центрове за стари хора",{"v":5548,"d":"55 4 8"}]
[{"v":5550,"d":"55 5 0"},"550 Центрове за социална рехабилитация и интеграция",{"v":5550,"d":"55 5 0"}]
[{"v":5551,"d":"55 5 1"},"551 Дневни центрове за лица с увреждания",{"v":5551,"d":"55 5 1"}]
[{"v":5553,"d":"55 5 3"},"553 Приюти",{"v":5553,"d":"55 5 3"}]
[{"v":5554,"d":"55 5 4"},"554 Защитени жилища",{"v":5554,"d":"55 5 4"}]
[{"v":5556,"d":"55 5 6"},"556 Приложни научни изследвания в областта на социалното осигуряване и подпомагане",{"v":5556,"d":"55 5 6"}]
[{"v":5561,"d":"55 6 1"},"561 Социални услуги в домашна среда",{"v":5561,"d":"55 6 1"}]
[{"v":5562,"d":"55 6 2"},"562 Асистенти за лична помощ",{"v":5562,"d":"55 6 2"}]
[{"v":5588,"d":"55 8 8"},"588 Международни програми и споразумения, дарения и помощи от чужбина",{"v":5588,"d":"55 8 8"}]
[{"v":5589,"d":"55 8 9"},"589 Други служби и дейности по социалното осигуряване, подпомагане и заетостта",{"v":5589,"d":"55 8 9"}]
[{"v":6601,"d":"66 0 1"},"601 Управление, контрол и регулиране на дейностите по жил. строителство и териториално развитие",{"v":6601,"d":"66 0 1"}]
[{"v":6602,"d":"66 0 2"},"602 Служби по кадастър, геодезия и регистрация на недвижимата собственост",{"v":6602,"d":"66 0 2"}]
[{"v":6603,"d":"66 0 3"},"603 Водоснабдяване и канализация",{"v":6603,"d":"66 0 3"}]
[{"v":6604,"d":"66 0 4"},"604 Осветление на улици и площади",{"v":6604,"d":"66 0 4"}]
[{"v":6605,"d":"66 0 5"},"605 Бани и перални",{"v":6605,"d":"66 0 5"}]
[{"v":6606,"d":"66 0 6"},"606 Изграждане, ремонт и поддържане на уличната мрежа",{"v":6606,"d":"66 0 6"}]
[{"v":6618,"d":"66 1 8"},"618 Международни програми и споразумения, дарения и помощи от чужбина",{"v":6618,"d":"66 1 8"}]
[{"v":6619,"d":"66 1 9"},"619 Други дейности по жилищното строителство, благоустройството и регионалното развитие",{"v":6619,"d":"66 1 9"}]
[{"v":6621,"d":"66 2 1"},"621 Управление, контрол и регулиране на дейностите по опазване на околната среда",{"v":6621,"d":"66 2 1"}]
[{"v":6622,"d":"66 2 2"},"622 Озеленяване",{"v":6622,"d":"66 2 2"}]
[{"v":6623,"d":"66 2 3"},"623 Чистота",{"v":6623,"d":"66 2 3"}]
[{"v":6624,"d":"66 2 4"},"624 Геозащита",{"v":6624,"d":"66 2 4"}]
[{"v":6625,"d":"66 2 5"},"625 Приложни и научни изследвания  в областта на опазване на околната среда",{"v":6625,"d":"66 2 5"}]
[{"v":6626,"d":"66 2 6"},"626 Пречистване на отпадъчните води от населените места",{"v":6626,"d":"66 2 6"}]
[{"v":6627,"d":"66 2 7"},"627 Управление на дейностите по отпадъците",{"v":6627,"d":"66 2 7"}]
[{"v":6628,"d":"66 2 8"},"628 Международни програми и споразумения, дарения и помощи от чужбина",{"v":6628,"d":"66 2 8"}]
[{"v":6629,"d":"66 2 9"},"629 Други дейности по опазване на околната среда",{"v":6629,"d":"66 2 9"}]
[{"v":7701,"d":"77 0 1"},"701 Дейности по почивното дело и социалния отдих",{"v":7701,"d":"77 0 1"}]
[{"v":7708,"d":"77 0 8"},"708 Международни програми и споразумения, дарения и помощи от чужбина",{"v":7708,"d":"77 0 8"}]
[{"v":7711,"d":"77 1 1"},"711 Управление, контрол и регулиране на дейностите по спорта",{"v":7711,"d":"77 1 1"}]
[{"v":7712,"d":"77 1 2"},"712 Детски и специализирани спортни школи",{"v":7712,"d":"77 1 2"}]
[{"v":7713,"d":"77 1 3"},"713 Спорт за всички",{"v":7713,"d":"77 1 3"}]
[{"v":7714,"d":"77 1 4"},"714 Спортни бази за спорт за всички",{"v":7714,"d":"77 1 4"}]
[{"v":7718,"d":"77 1 8"},"718 Международни програми и споразумения, дарения и помощи от чужбина",{"v":7718,"d":"77 1 8"}]
[{"v":7719,"d":"77 1 9"},"719 Други дейности по спорта и физическата култура",{"v":7719,"d":"77 1 9"}]
[{"v":7731,"d":"77 3 1"},"731 Управление, контрол и регулиране на дейностите по културата",{"v":7731,"d":"77 3 1"}]
[{"v":7732,"d":"77 3 2"},"732 Културни дейности",{"v":7732,"d":"77 3 2"}]
[{"v":7733,"d":"77 3 3"},"733 Български културни институти в чужбина",{"v":7733,"d":"77 3 3"}]
[{"v":7735,"d":"77 3 5"},"735 Театри",{"v":7735,"d":"77 3 5"}]
[{"v":7736,"d":"77 3 6"},"736 Оперно - филхармонични дружества и опери",{"v":7736,"d":"77 3 6"}]
[{"v":7737,"d":"77 3 7"},"737 Оркестри и ансамбли",{"v":7737,"d":"77 3 7"}]
[{"v":7738,"d":"77 3 8"},"738 Читалища",{"v":7738,"d":"77 3 8"}]
[{"v":7739,"d":"77 3 9"},"739 Музеи, худ. галерии, паметници на културата и етногр. комплекси с национален и регионален харакер",{"v":7739,"d":"77 3 9"}]
[{"v":7740,"d":"77 4 0"},"740 Музеи, художествени галерии, паметници на културата и етнографски комплекси с местен харакер",{"v":7740,"d":"77 4 0"}]
[{"v":7741,"d":"77 4 1"},"741 Радиотранслационни възли",{"v":7741,"d":"77 4 1"}]
[{"v":7742,"d":"77 4 2"},"742 Радио",{"v":7742,"d":"77 4 2"}]
[{"v":7743,"d":"77 4 3"},"743 Телевизия",{"v":7743,"d":"77 4 3"}]
[{"v":7744,"d":"77 4 4"},"744 Филмотечно и фонотечно дело",{"v":7744,"d":"77 4 4"}]
[{"v":7745,"d":"77 4 5"},"745 Обредни домове и зали",{"v":7745,"d":"77 4 5"}]
[{"v":7746,"d":"77 4 6"},"746 Зоопаркове",{"v":7746,"d":"77 4 6"}]
[{"v":7747,"d":"77 4 7"},"747 Държавен архив и териториални архиви",{"v":7747,"d":"77 4 7"}]
[{"v":7748,"d":"77 4 8"},"748 Подпомагане развитието на културата",{"v":7748,"d":"77 4 8"}]
[{"v":7751,"d":"77 5 1"},"751 Библиотеки с национален и регионален характер",{"v":7751,"d":"77 5 1"}]
[{"v":7752,"d":"77 5 2"},"752 Градски библиотеки",{"v":7752,"d":"77 5 2"}]
[{"v":7755,"d":"77 5 5"},"755 Приложни и научни изследвания  в областта на опазване на културата",{"v":7755,"d":"77 5 5"}]
[{"v":7758,"d":"77 5 8"},"758 Международни програми и споразумения, дарения и помощи от чужбина",{"v":7758,"d":"77 5 8"}]
[{"v":7759,"d":"77 5 9"},"759 Други дейности по културата",{"v":7759,"d":"77 5 9"}]
[{"v":7761,"d":"77 6 1"},"761 Контрол и регулиране на дейностите по религиозно дело",{"v":7761,"d":"77 6 1"}]
[{"v":7762,"d":"77 6 2"},"762 Субсидии и други разходи за дейности по религиозно дело",{"v":7762,"d":"77 6 2"}]
[{"v":7768,"d":"77 6 8"},"768 Международни програми и споразумения, дарения и помощи от чужбина",{"v":7768,"d":"77 6 8"}]
[{"v":8801,"d":"88 0 1"},"801 Управление, контрол и регулиране на минното дело и дейностите по енергетиката",{"v":8801,"d":"88 0 1"}]
[{"v":8802,"d":"88 0 2"},"802 Изследвания, измервания и анализи на горивата и енергията",{"v":8802,"d":"88 0 2"}]
[{"v":8803,"d":"88 0 3"},"803 Безопасност и съхраняване на радиоактивни отпадъци",{"v":8803,"d":"88 0 3"}]
[{"v":8804,"d":"88 0 4"},"804 Извеждане на ядрени съоръжения от експлоатация",{"v":8804,"d":"88 0 4"}]
[{"v":8805,"d":"88 0 5"},"805 Приложни и научни изследвания  в областта на минното дело, горивата и енергията",{"v":8805,"d":"88 0 5"}]
[{"v":8807,"d":"88 0 7"},"807 Международни програми и споразумения, дарения и помощи от чужбина",{"v":8807,"d":"88 0 7"}]
[{"v":8808,"d":"88 0 8"},"808 Други дейности по минното дело",{"v":8808,"d":"88 0 8"}]
[{"v":8809,"d":"88 0 9"},"809 Други дейности по горивата и енергията",{"v":8809,"d":"88 0 9"}]
[{"v":8811,"d":"88 1 1"},"811 Управление, контрол и регулиране на дейностите по растениевъдство",{"v":8811,"d":"88 1 1"}]
[{"v":8813,"d":"88 1 3"},"813 Областни земеделски служби",{"v":8813,"d":"88 1 3"}]
[{"v":8814,"d":"88 1 4"},"814 Управление, контрол и регулиране на дейностите по горското стопанство",{"v":8814,"d":"88 1 4"}]
[{"v":8815,"d":"88 1 5"},"815 Управление, контрол и регулиране на дейностите по лова и риболова",{"v":8815,"d":"88 1 5"}]
[{"v":8816,"d":"88 1 6"},"816 Машинно-изпитателни центрове и контролно технически инспекции",{"v":8816,"d":"88 1 6"}]
[{"v":8817,"d":"88 1 7"},"817 Ветеринарно-медицински служби",{"v":8817,"d":"88 1 7"}]
[{"v":8821,"d":"88 2 1"},"821 Други служби по поземлената реформа",{"v":8821,"d":"88 2 1"}]
[{"v":8824,"d":"88 2 4"},"824 Национални доплащания и съфинансиране към директните плащания за земеделски производители",{"v":8824,"d":"88 2 4"}]
[{"v":8825,"d":"88 2 5"},"825 Приложни и научни изследвания  в областта на земеделието и горите",{"v":8825,"d":"88 2 5"}]
[{"v":8826,"d":"88 2 6"},"826 Рибарство",{"v":8826,"d":"88 2 6"}]
[{"v":8827,"d":"88 2 7"},"827 Развитие на селските райони",{"v":8827,"d":"88 2 7"}]
[{"v":8828,"d":"88 2 8"},"828 Международни програми и споразумения, дарения и помощи от чужбина",{"v":8828,"d":"88 2 8"}]
[{"v":8829,"d":"88 2 9"},"829 Други дейности по селско и горско стопанство, лов и риболов",{"v":8829,"d":"88 2 9"}]
[{"v":8831,"d":"88 3 1"},"831 Управление,контрол и регулиране на дейностите по транспорта и пътищата",{"v":8831,"d":"88 3 1"}]
[{"v":8832,"d":"88 3 2"},"832 Служби и дейности по поддържане, ремонт и изграждане на пътищата",{"v":8832,"d":"88 3 2"}]
[{"v":8833,"d":"88 3 3"},"833 Проучвания, измервания и анализи на пътната мрежа",{"v":8833,"d":"88 3 3"}]
[{"v":8834,"d":"88 3 4"},"834 Дейности по автомобилния транспорт",{"v":8834,"d":"88 3 4"}]
[{"v":8835,"d":"88 3 5"},"835 Дейности по железопътния транспорт",{"v":8835,"d":"88 3 5"}]
[{"v":8836,"d":"88 3 6"},"836 Дейности по въздушния транспорт",{"v":8836,"d":"88 3 6"}]
[{"v":8837,"d":"88 3 7"},"837 Дейности по водния транспорт",{"v":8837,"d":"88 3 7"}]
[{"v":8838,"d":"88 3 8"},"838 Управление, контрол и регулиране на дейностите по комуникациите",{"v":8838,"d":"88 3 8"}]
[{"v":8839,"d":"88 3 9"},"839 Пощи и далекосъобщения",{"v":8839,"d":"88 3 9"}]
[{"v":8845,"d":"88 4 5"},"845 Приложни и научни изследвания  в областта на транспорта и съобщенията",{"v":8845,"d":"88 4 5"}]
[{"v":8848,"d":"88 4 8"},"848 Международни програми и споразумения, дарения и помощи от чужбина",{"v":8848,"d":"88 4 8"}]
[{"v":8849,"d":"88 4 9"},"849 Други дейности по транспорта,пътищата,пощите и далекосъобщенията",{"v":8849,"d":"88 4 9"}]
[{"v":8851,"d":"88 5 1"},"851 Управление, контрол и регулиране на дейностите по промишлеността",{"v":8851,"d":"88 5 1"}]
[{"v":8852,"d":"88 5 2"},"852 Управление, контрол и регулиране на дейностите по строителството",{"v":8852,"d":"88 5 2"}]
[{"v":8853,"d":"88 5 3"},"853 Международни програми и споразумения, дарения и помощи от чужбина",{"v":8853,"d":"88 5 3"}]
[{"v":8855,"d":"88 5 5"},"855 Приложни и научни изследвания  в областта на промишлеността и строителството",{"v":8855,"d":"88 5 5"}]
[{"v":8858,"d":"88 5 8"},"858 Други дейности по промишлеността",{"v":8858,"d":"88 5 8"}]
[{"v":8859,"d":"88 5 9"},"859 Други дейности по строителството",{"v":8859,"d":"88 5 9"}]
[{"v":8861,"d":"88 6 1"},"861 Управление, контрол и регулиране на дейностите по туризма",{"v":8861,"d":"88 6 1"}]
[{"v":8862,"d":"88 6 2"},"862 Туристически бази",{"v":8862,"d":"88 6 2"}]
[{"v":8863,"d":"88 6 3"},"863 Специализирани спортно-туристически школи",{"v":8863,"d":"88 6 3"}]
[{"v":8864,"d":"88 6 4"},"864 Международни програми и споразумения, дарения и помощи от чужбина",{"v":8864,"d":"88 6 4"}]
[{"v":8865,"d":"88 6 5"},"865 Други дейности по туризма",{"v":8865,"d":"88 6 5"}]
[{"v":8866,"d":"88 6 6"},"866 Общински пазари и тържища",{"v":8866,"d":"88 6 6"}]
[{"v":8867,"d":"88 6 7"},"867 Реклама и маркетинг",{"v":8867,"d":"88 6 7"}]
[{"v":8868,"d":"88 6 8"},"868 Информационно-изчислителни центрове",{"v":8868,"d":"88 6 8"}]
[{"v":8869,"d":"88 6 9"},"869 Издателска дейност и печатни бази",{"v":8869,"d":"88 6 9"}]
[{"v":8871,"d":"88 7 1"},"871 Помощни стопанства, столове и други спомагателни дейности",{"v":8871,"d":"88 7 1"}]
[{"v":8872,"d":"88 7 2"},"872 Дворци, резиденции и стопанства",{"v":8872,"d":"88 7 2"}]
[{"v":8873,"d":"88 7 3"},"873 Оздравителни програми за предприятия в изолация и ликвидация",{"v":8873,"d":"88 7 3"}]
[{"v":8875,"d":"88 7 5"},"875 Органи и дейности по приватизация",{"v":8875,"d":"88 7 5"}]
[{"v":8876,"d":"88 7 6"},"876 Органи по стандартизация и метрология",{"v":8876,"d":"88 7 6"}]
[{"v":8877,"d":"88 7 7"},"877 Патентно дело",{"v":8877,"d":"88 7 7"}]
[{"v":8878,"d":"88 7 8"},"878 Приюти за безстопанствени животни",{"v":8878,"d":"88 7 8"}]
[{"v":8885,"d":"88 8 5"},"885 Приложни и научни изследвания  в други дейности по икономиката",{"v":8885,"d":"88 8 5"}]
[{"v":8888,"d":"88 8 8"},"888 Структурни реформи",{"v":8888,"d":"88 8 8"}]
[{"v":8897,"d":"88 9 7"},"897 Международни програми и споразумения, дарения и помощи от чужбина",{"v":8897,"d":"88 9 7"}]
[{"v":8898,"d":"88 9 8"},"898 Други дейности по икономиката",{"v":8898,"d":"88 9 8"}]
[{"v":9910,"d":"99 1 0"},"910 Разходи за лихви",{"v":9910,"d":"99 1 0"}]
[{"v":9997,"d":"99 9 7"},"997 Други разходи некласифицирани по другите функции",{"v":9997,"d":"99 9 7"}]
[{"v":9998,"d":"99 9 8"},"998 Резерв ",{"v":9998,"d":"99 9 8"}]
[]
[]
[]
[]
["Name:","\"OP_LIST\"  и \"OP_LIST2\""]
["ИЗБЕРЕТЕ ОПЕРАТИВНА ПРОГРАМА "]
["ПЕРИОД 2014-2020"]
["КФ - ОП \"Транспорт и транспортна инфраструктура\"","98111"]
["КФ - ОП \"Околна среда\"","98112"]
["ЕФРР - ОП \"Транспорт и транспортна инфраструктура\"","98211"]
["ЕФРР - ОП \"Региони в растеж\"","98212"]
["ЕФРР - ОП \"Наука и образование за интелигентен растеж\"","98213"]
["ЕФРР - ОП \"Иновации и конкурентоспособност \"","98214"]
["ЕФРР - ОП \"Околна среда\"","98215"]
["ЕФРР - ОП \"Инициатива за малки и средни предприятия\"","98224"]
["ЕСФ - ОП \"Развитие на човешките ресурси\"","98311"]
["ЕСФ - ОП \"Добро управление\"","98312"]
["ЕСФ - ОП \"Наука и образование за интелигентен растеж\"","98313"]
["ОП \"Фонд за европейско подпомагане на най-нуждаещите се лица\" ",98315]
["ПЕРИОД 2007-2013"]
["КФ - ОП \"ТРАНСПОРТ\"","98101"]
["КФ - ОП \"ОКОЛНА СРЕДА\" /2007-2013/","98102"]
["ЕФРР - ОП \"ТРАНСПОРТ\"","98201"]
["ЕФРР - ОП \"РЕГИОНАЛНО РАЗВИТИЕ\"","98202"]
["ЕФРР - ОП \"КОНКУРЕНТНОСПОСОБНОСТ\"","98204"]
["ЕФРР - ОП \"ОКОЛНА СРЕДА\" /2007-2013/","98205"]
["ЕФРР - ОП \"ТЕХНИЧЕСКА ПОМОЩ\"","98210"]
["ЕСФ - ОП \"ЧОВЕШКИ РЕСУРСИ\"","98301"]
["ЕСФ - ОП \"АДМИНИСТРАТИВЕН КАПАЦИТЕТ\"","98302"]
[]
[]
["Name:","\"PRBK\""]
[null,"А ) Кодове на бюджетни организации от подсектор \"централно управление\" (подсектор \"ЦУ\")"]
[null,"    А.1) Кодове на централния бюджет и разпоредителите с бюджет по държавния бюджет"]
["0100","Народно събрание"]
["0200","Администрация на президентството"]
["0300","Министерски съвет "]
["0400","Конституционен съд"]
["0500","Сметна палата"]
["0600","Висш съдебен съвет"]
["1000","Министерство на финансите"]
["1100","Министерство на външните работи"]
["1200","Министерство на отбраната"]
["1300","Министерство на вътрешните работи"]
["1400","Министерство на правосъдието"]
["1500","Министерство на труда и социалната политика"]
["1600","Министерство на здравеопазването"]
["1700","Министерство на образованието и науката "]
["1800","Министерство на културата"]
["1900","Министерство на околната среда и водите"]
["2000","Министерство на икономиката"]
["2100","Министерство на регионалното развитие и благоустройство"]
["2200","Министерство на земеделието и храните"]
["2300","Министерство на транспорта, информационните технологии и съобщенията"]
["2400","Министерство на енергетиката"]
["2500","Министерство на младежта и спорта"]
["3000","Държавна агенция  \"Национална сигурност\""]
["3200","Комисия за разкриване на документите и за обявяване на принадлежност на български граждани към Държавна сигурност и разузнавателните служби на Българската народна армия"]
["3300","Комисия за защита от дискриминация"]
["3400","Комисия за защита на личните данни"]
["3500","Държавна агенция “Електронно управление”"]
["3700","Комисия за отнемане на незаконно придобито имущество"]
["3800","Национална служба за охрана"]
["3900","Държавна агенция \"Разузнаване\""]
["4000","Омбудсман"]
["4100","Национален статистически институт"]
["4200","Комисия за защита на конкуренцията"]
["4300","Комисия за регулиране на съобщенията"]
["4400","Съвет за електронни медии"]
["4500","Комисия за енергийно и водно регулиране"]
["4600","Агенция за ядрено регулиране"]
["4700","Комисия за финансов надзор"]
["4800","Държавна комисия по сигурността на информацията"]
["5300","Държавна агенция \"Държавен резерв и военновременни запаси\""]
["6100","Българска национална телевизия"]
["6200","Българско национално радио"]
["6300","Българска телеграфна агенция"]
["7100","Министерство на туризма"]
["7900","Министерство за Българското председателство на Съвета на Европейския съюз 2018"]
["8200","Централна избирателна комисия"]
["8300","Комисия за публичен надзор над регистрираните одитори"]
["8400","Държавен фонд \"Земеделие\""]
["8500","Национално бюро за контрол на специалните разузнавателни средства"]
["8600","Държавна агенция „Технически операции”"]
["9900","Централен бюджет"]
[null,"     А.2) Кодове на други бюджетни организации от подсектор \"централно управление\""]
[null,"    А.2.1) кодове на държавните висши училища и Българската академия на науките"]
[null,"        А.2.1а) кодове на ДВУ и БАН, финансирани от Министерството на образованието и науката"]
["1701","Софийски университет \"Климент Охридски\" - София"]
["1702","Пловдивски университет \"Паисий Хилендарски\" - Пловдив"]
["1703","Университет \"Проф. д-р Асен Златаров\" - Бургас"]
["1704","Великотърновки университет \"Св. св . Кирил и Методий\" - В. Търново"]
["1705","Югозападен университет \"Неофит Рилски\" - Благоевград"]
["1706","Шуменски университет \"Епископ Константин Преславски\" - Шумен"]
["1711","Русенски университет \"Ангел Кънчев\" - Русе"]
["1712","Технически университет - София"]
["1713","Технически университет - София - филиал Пловдив"]
["1714","Технически университет - Варна"]
["1715","Технически университет - Габрово"]
["1716","Университет по архитектура, строителство и геодезия - София"]
["1717","Минно-геоложки университет \"Св. Ив. Рилски\" - София"]
["1718","Лесотехнически университет - София"]
["1719","Химико-технологичен и металургичен университет - София",""]
["1721","Университет по хранителни технологии - Пловдив",""]
["1722","Аграрен университет - Пловдив",""]
["1723","Тракийски университет - Стара Загора",""]
["1731","Медицински университет - София",""]
["1732","Медицински университет - Пловдив",""]
["1733","Медицински университет \"Проф. д-р Параскев Иванов Стоянов\" - Варна",""]
["1734","Тракийски университет - Стара Загора - медицински факултет",""]
["1735","Медицински университет - Плевен",""]
["1741","Университет за национално и световно стопанство - София",""]
["1742","Икономически университет - Варна",""]
["1743","Стопанска академия \"Димитър Ценов\" - Свищов",""]
["1751","Държавна музикална академия \"Панчо Владигеров\" - София",""]
["1752","Национална академия за театрално и филмово изкуство \"Кр. Сарафов\" - София",""]
["1753","Национална художествена академия - София",""]
["1754","Академия за музикално, танцово и изобразително изкуство - Пловдив",""]
["1759","Национална спортна академия \"Васил Левски\" - София",""]
["1767","Висше строително училище \"Любен Каравелов\" - София",""]
["1768","Висше транспортно училище \"Тодор Каблешков\" - София",""]
["1771","Университет по библиотекознание и информационни технологии - София ",""]
["1772","Висше училище по телекомуникации и пощи - София",""]
["1790","Българска академия на науките - София",""]
["","        А.2.1.б) кодове на ДВУ и ВА \"Г. С. Раковски\", финансирани от Министерството на отбраната",""]
["1281","Военна академия \"Г. С. Раковски\" - София",""]
["1282","Национален военен университет \"Васил Левски\" - Велико Търново",""]
["1283","Висше военноморско училище \"Н. Й. Вапцаров\" - Варна",""]
["","    А.2.2) кодове на други разпоредители с бюджет по чл. 13, ал. 3 от ЗПФ",""]
["6100","Българска национална телевизия",""]
["6200","Българско национално радио",""]
["6300","Българска телеграфна агенция",""]
["","    А.2.3) кодове на разпоредители с бюджет по чл. 13, ал. 4 от ЗПФ",""]
["1313","Държавно предприятие „Център за предоставяне на услуги”",""]
["3535","Държавно предприятие „Единен системен оператор“ ",""]
["1950","Предприятие за управление на дейностите по опазване на околната среда (ПУДООС)                    - чл. 60 от ЗООС",""]
["2170","Национална компания \"Стратегически инфраструктурни проекти\"                                                      - чл. 28a от Закона за пътищата",""]
["2480","Фонд \"Сигурност на електроенергийната система\"",""]
["9817","Национален фонд към Министерството на финансите",""]
["2220","Държавен фонд \"Земеделие\" - Разплащателна агенция",""]
["1060","Сметка към министъра на финансите за средствата от продажбата на предписани емисионни единици (§ 10, ал. 1 от ЗПФ)",""]
["5500","Национален осигурителен институт - Държавно обществено осигуряване",""]
["5591","Национален осигурителен институт - Учителски пенсионен фонд",""]
["5592","Национален осигрителен инститт - фонд \"Гарантирани вземания на работници и служители\"",""]
["5600","Национална здравноосигурителна каса",""]
["5101","Банско",""]
["5102","Белица",""]
["5103","Благоевград",""]
["5104","Гоце Делчев",""]
["5105","Гърмен",""]
["5106","Кресна",""]
["5107","Петрич",""]
["5108","Разлог",""]
["5109","Сандански",""]
["5110","Сатовча",""]
["5111","Симитли",""]
["5112","Струмяни",""]
["5113","Хаджидимово",""]
["5114","Якоруда",""]
["5201","Айтос",""]
["5202","Бургас ",""]
["5203","Камено",""]
["5204","Карнобат",""]
["5205","Малко Търново",""]
["5206","Несебър",""]
["5207","Поморие",""]
["5208","Приморско",""]
["5209","Руен",""]
["5210","Созопол",""]
["5211","Средец",""]
["5212","Сунгурларе",""]
["5213","Царево",""]
["5301","Аврен",""]
["5302","Аксаково",""]
["5303","Белослав",""]
["5304","Бяла",""]
["5305","Варна",""]
["5306","Ветрино",""]
["5307","Вълчидол",""]
["5308","Девня",""]
["5309","Долни Чифлик",""]
["5310","Дългопол",""]
["5311","Провадия",""]
["5312","Суворово",""]
["5401","Велико Търново",""]
["5402","Горна Оряховица",""]
["5403","Елена",""]
["5404","Златарица",""]
["5405","Лясковец",""]
["5406","Павликени",""]
["5407","Полски Тръмбеш",""]
["5408","Свищов",""]
["5409","Стражица",""]
["5410","Сухиндол",""]
["5501","Белоградчик",""]
["5502","Бойница",""]
["5503","Брегово",""]
["5504","Видин",""]
["5505","Грамада",""]
["5506","Димово",""]
["5507","Кула",""]
["5508","Макреш",""]
["5509","Ново село",""]
["5510","Ружинци",""]
["5511","Чупрене",""]
["5601","Борован",""]
["5602","Бяла Слатина",""]
["5603","Враца",""]
["5605","Козлодуй",""]
["5606","Криводол",""]
["5607","Мездра",""]
["5608","Мизия",""]
["5609","Оряхово",""]
["5610","Роман",""]
["5611","Хайредин",""]
["5701","Габрово",""]
["5702","Дряново",""]
["5703","Севлиево",""]
["5704","Трявна",""]
["5801","Балчик",""]
["5802","Генерал Тошево",""]
["5803","Добрич",""]
["5804","Добричка",""]
["5805","Каварна",""]
["5806","Крушари",""]
["5807","Тервел",""]
["5808","Шабла",""]
["5901","Ардино",""]
["5902","Джебел",""]
["5903","Кирково",""]
["5904","Крумовград",""]
["5905","Кърджали",""]
["5906","Момчилград",""]
["5907","Черноочене",""]
["6001","Бобовдол",""]
["6002","Бобошево",""]
["6003","Дупница",""]
["6004","Кочериново",""]
["6005","Кюстендил",""]
["6006","Невестино",""]
["6007","Рила",""]
["6008","Сапарева баня",""]
["6009","Трекляно",""]
["6101","Априлци",""]
["6102","Летница",""]
["6103","Ловеч",""]
["6104","Луковит",""]
["6105","Тетевен",""]
["6106","Троян",""]
["6107","Угърчин",""]
["6108","Ябланица",""]
["6201","Берковица",""]
["6202","Бойчиновци",""]
["6203","Брусарци",""]
["6204","Вълчедръм",""]
["6205","Вършец",""]
["6206","Георги Дамяново",""]
["6207","Лом",""]
["6208","Медковец",""]
["6209","Монтана",""]
["6210","Чипровци",""]
["6211","Якимово",""]
["6301","Батак",""]
["6302","Белово",""]
["6303","Брацигово",""]
["6304","Велинград",""]
["6305","Лесичово",""]
["6306","Пазарджик",""]
["6307","Панагюрище",""]
["6308","Пещера",""]
["6309","Ракитово",""]
["6310","Септември",""]
["6311","Стрелча",""]
["6312","Сърница",""]
["6401","Брезник",""]
["6402","Земен",""]
["6403","Ковачевци",""]
["6404","Перник",""]
["6405","Радомир",""]
["6406","Трън",""]
["6501","Белене",""]
["6502","Гулянци",""]
["6503","Долна Митрополия",""]
["6504","Долни Дъбник",""]
["6505","Искър",""]
["6506","Левски",""]
["6507","Никопол",""]
["6508","Плевен",""]
["6509","Пордим",""]
["6510","Червен бряг",""]
["6511","Кнежа",""]
["6601","Асеновград",""]
["6602","Брезово",""]
["6603","Калояново",""]
["6604","Карлово",""]
["6605","Кричим",""]
["6606","Лъки",""]
["6607","Марица",""]
["6608","Перущица",""]
["6609","Пловдив",""]
["6610","Първомай",""]
["6611","Раковски",""]
["6612","Родопи",""]
["6613","Садово",""]
["6614","Стамболийски",""]
["6615","Съединение",""]
["6616","Хисаря",""]
["6617","Куклен",""]
["6618","Сопот",""]
["6701","Завет",""]
["6702","Исперих",""]
["6703","Кубрат",""]
["6704","Лозница",""]
["6705","Разград",""]
["6706","Самуил",""]
["6707","Цар Калоян",""]
["6801","Борово",""]
["6802","Бяла",""]
["6803","Ветово",""]
["6804","Две могили",""]
["6805","Иваново",""]
["6806","Русе",""]
["6807","Сливо поле",""]
["6808","Ценово",""]
["6901","Алфатар",""]
["6902","Главиница",""]
["6903","Дулово",""]
["6904","Кайнарджа",""]
["6905","Силистра",""]
["6906","Ситово",""]
["6907","Тутракан",""]
["7001","Котел",""]
["7002","Нова Загора",""]
["7003","Сливен",""]
["7004","Твърдица",""]
["7101","Баните",""]
["7102","Борино",""]
["7103","Девин",""]
["7104","Доспат",""]
["7105","Златоград",""]
["7106","Мадан",""]
["7107","Неделино",""]
["7108","Рудозем",""]
["7109","Смолян",""]
["7110","Чепеларе",""]
["7201","Район Банкя",""]
["7202","Район Витоша",""]
["7203","Район Възраждане ",""]
["7204","Район Връбница",""]
["7205","Район Илинден",""]
["7206","Район Искър",""]
["7207","Район Изгрев",""]
["7208","Район Красна Поляна",""]
["7209","Район Красно село",""]
["7210","Район Кремиковци",""]
["7211","Район Лозенец",""]
["7212","Район Люлин",""]
["7213","Район Младост",""]
["7214","Район Надежда",""]
["7215","Район Нови Искър",""]
["7216","Район Оборище",""]
["7217","Район Овча Купел",""]
["7218","Район Панчарево",""]
["7219","Район Подуяне",""]
["7220","Район Сердика",""]
["7221","Район Слатина",""]
["7222","Район Средец",""]
["7223","Район Студентска",""]
["7224","Район Триадица",""]
["7225","Столична община",""]
["7301","Антон",""]
["7302","Божурище",""]
["7303","Ботевград",""]
["7304","Годеч",""]
["7305","Горна Малина",""]
["7306","Долна Баня",""]
["7307","Драгоман ",""]
["7308","Елин Пелин",""]
["7309","Етрополе",""]
["7310","Златица",""]
["7311","Ихтиман",""]
["7312","Копривщица",""]
["7313","Костенец",""]
["7314","Костинброд",""]
["7315","Мирково",""]
["7316","Пирдоп",""]
["7317","Правец",""]
["7318","Самоков",""]
["7319","Своге",""]
["7320","Сливница",""]
["7321","Чавдар",""]
["7322","Челопеч",""]
["7401","Братя Даскалови",""]
["7402","Гурково",""]
["7403","Гълъбово",""]
["7404","Казанлък",""]
["7405","Мъглиж",""]
["7406","Николаево",""]
["7407","Опан",""]
["7408","Павел баня",""]
["7409","Раднево",""]
["7410","Стара Загора",""]
["7411","Чирпан",""]
["7501","Антоново",""]
["7502","Омуртаг",""]
["7503","Опака",""]
["7504","Попово",""]
["7505","Търговище",""]
["7601","Димитровград",""]
["7602","Ивайловград",""]
["7603","Любимец",""]
["7604","Маджарово",""]
["7605","Минерални Бани",""]
["7606","Свиленград",""]
["7607","Симеоновград",""]
["7608","Стамболово",""]
["7609","Тополовград",""]
["7610","Харманли",""]
["7611","Хасково",""]
["7701","Велики Преслав",""]
["7702","Венец",""]
["7703","Върбица",""]
["7704","Каолиново",""]
["7705","Каспичан",""]
["7706","Никола Козлево",""]
["7707","Нови пазар",""]
["7708","Смядово",""]
["7709","Хитрино",""]
["7710","Шумен",""]
["7801","Болярово",""]
["7802","Елхово",""]
["7803","Стралджа",""]
["7804","Тунджа",""]
["7805","Ямбол",""]
[]
["Name:","Date","Name:"]
[null,"2020-01-31","януари"]
[null,"2020-02-29","февруари"]
[null,"2020-03-31","март"]
[null,"2020-04-30","април"]
[null,"2020-05-31","май"]
[null,"2020-06-30","юни"]
[null,"2020-07-31","юли"]
[null,"2020-08-31","август"]
[null,"2020-09-30","септември"]
[null,"2020-10-31","октомври"]
[null,"2020-11-30","ноември"]
[null,"2020-12-31","декември"]

{"sheet":"INF","index":4,"n_rows":154,"n_cols":21,"rows_kept":154,"hidden":true,"merged":[[13,8,13,10],[15,8,15,10],[18,8,18,10],[22,11,22,14],[22,15,22,18],[29,9,29,10],[32,9,32,10],[38,9,38,10],[46,9,46,10],[47,9,47,10],[65,9,65,10],[69,9,69,10],[75,9,75,10],[78,9,78,10],[79,9,79,10],[80,9,80,10],[81,9,81,10],[82,9,82,10],[97,9,97,10],[98,9,98,10],[99,9,99,10],[100,9,100,10],[107,9,107,10],[111,9,111,10],[112,9,112,10],[113,9,113,10],[114,9,114,10],[117,9,117,10],[118,9,118,10],[126,9,126,10],[129,9,129,10],[130,9,130,10],[135,9,135,10],[139,9,139,10],[140,9,140,10]]}
["step",137]
["gotocell","c1468"]
["nextcell","b1296"]
["INF copyrf","i12:u149"]
["dejKN"]
[]
[]
[null,"d1175"]
[]
[]
["Step:"]
[1,{"$nulls":18},{"$f":"(IF($E145<>0,$M$2,IF($L145<>0,$M$2,\"\")))","v":""}]
[2,{"$nulls":18},{"$f":"(IF($E145<>0,$M$2,IF($L145<>0,$M$2,\"\")))","v":""}]
[3,{"$nulls":7},{"$f":"$B$7","v":0},{"$nulls":10},{"$f":"(IF($E145<>0,$M$2,IF($L145<>0,$M$2,\"\")))","v":""}]
[4,{"$nulls":10},"за периода от ","до",null,"        II.1. РАЗХОДИ ПО ДЕЙНОСТИ",{"$nulls":4},{"$f":"(IF($E145<>0,$M$2,IF($L145<>0,$M$2,\"\")))","v":""}]
[5,{"$nulls":7},{"$f":"$B$9","v":0},null,null,{"$f":"$E$9","v":"00:00:00"},{"$f":"$F$9","v":"00:00:00"},{"$nulls":6},{"$f":"(IF($E145<>0,$M$2,IF($L145<>0,$M$2,\"\")))","v":""}]
[6,{"$nulls":7},{"$f":"$B$10","v":0},{"$nulls":10},{"$f":"(IF($E145<>0,$M$2,IF($L145<>0,$M$2,\"\")))","v":""}]
[7,{"$nulls":18},{"$f":"(IF($E145<>0,$M$2,IF($L145<>0,$M$2,\"\")))","v":""}]
[8,{"$nulls":7},{"$f":"$B$12","v":0},null,null,"       код по ЕБК:",{"$f":"$F$12","v":{"v":0,"d":"0 0 0 0"}},{"$nulls":6},{"$f":"(IF($E145<>0,$M$2,IF($L145<>0,$M$2,\"\")))","v":""}]
[9,{"$nulls":7},{"$f":"$B$13","v":0},{"$nulls":10},{"$f":"(IF($E145<>0,$M$2,IF($L145<>0,$M$2,\"\")))","v":""}]
[10,{"$nulls":9},"ФИНАНСОВО-ПРАВНА ФОРМА",{"$f":"$E$15","v":0},{"$f":"$F$15","v":0},{"$nulls":6},{"$f":"(IF($E145<>0,$M$2,IF($L145<>0,$M$2,\"\")))","v":""}]
[11,{"$nulls":17},"(в лева)",{"$f":"(IF($E145<>0,$M$2,IF($L145<>0,$M$2,\"\")))","v":""}]
[12,{"$nulls":9},"II.1. РАЗХОДИ ПО ДЕЙНОСТИ","Уточнен план 2020",{"$nulls":3},"Отчет 2020",{"$nulls":3},{"$f":"(IF($E145<>0,$M$2,IF($L145<>0,$M$2,\"\")))","v":""}]
[13,{"$nulls":7},"§§","под-§§","НАИМЕНОВАНИЯ НА ПАРАГРАФИТЕ И ПОДПАРАГРАФИТЕ",{"$f":"$E$20","v":0},{"$f":"$F$20","v":0},{"$f":"$G$20","v":0},{"$f":"$H$20","v":0},{"$f":"$I$20","v":0},{"$f":"$J$20","v":0},{"$f":"$K$20","v":0},{"$f":"$L$20","v":0},{"$f":"(IF($E145<>0,$M$2,IF($L145<>0,$M$2,\"\")))","v":""}]
[14,{"$nulls":9}," 02 ¦",{"$f":"$E$21","v":0},{"$f":"$F$21","v":0},{"$f":"$G$21","v":0},{"$f":"$H$21","v":0},{"$f":"$I$21","v":0},{"$f":"$J$21","v":0},{"$f":"$K$21","v":"ФИНАНСОВО-ПРАВНА ФОРМА"},{"$f":"$L$21","v":0},{"$f":"(IF($E145<>0,$M$2,IF($L145<>0,$M$2,\"\")))","v":""}]
[15,{"$nulls":8},{"$f":"VLOOKUP(K26,OP_LIST2,2,FALSE)","v":0},"ИЗБЕРЕТЕ ОПЕРАТИВНА ПРОГРАМА ",{"$nulls":8},{"$f":"(IF($E145<>0,$M$2,IF($L145<>0,$M$2,\"\")))","v":""}]
[16,{"$nulls":8},{"$f":"VLOOKUP(K28,EBK_DEIN2,2,FALSE)","v":{"v":0,"d":"0000"}},"<------          ДЕЙНОСТ    -  код  по  ЕБК",{"$nulls":8},{"$f":"(IF($E145<>0,$M$2,IF($L145<>0,$M$2,\"\")))","v":""}]
[17,{"$nulls":8},{"$f":"+J27","v":0},"ИЗБЕРЕТЕ ДЕЙНОСТ",{"$nulls":8},{"$f":"(IF($E145<>0,$M$2,IF($L145<>0,$M$2,\"\")))","v":""}]
[18,{"$nulls":9},"(наименование на дейността)",{"$nulls":8},{"$f":"(IF($E145<>0,$M$2,IF($L145<>0,$M$2,\"\")))","v":""}]
[19,{"$nulls":7},{"v":100,"d":"01-00"},"Заплати и възнаграждения за персонала, нает по трудови и служебни правоотношения",null,{"$f":"SUM(L31:L32)","v":0},0,0,{"$f":"SUM(O31:O32)","v":0},0,0,0,0,{"$f":"(IF($E30<>0,$M$2,IF($L30<>0,$M$2,\"\")))","v":""}]
[20,{"$nulls":8},{"v":101,"d":"01-01"},"заплати и възнаграждения на персонала нает по трудови правоотношения",{"$f":"M31+N31+O31","v":0},{"$nulls":6},{"$f":"P31+Q31+R31","v":0},{"$f":"(IF($E31<>0,$M$2,IF($L31<>0,$M$2,\"\")))","v":""}]
[21,{"$nulls":8},{"v":102,"d":"01-02"},"заплати и възнаграждения на персонала нает по служебни правоотношения",{"$f":"M32+N32+O32","v":0},{"$nulls":6},{"$f":"P32+Q32+R32","v":0},""]
[22,{"$nulls":7},{"v":200,"d":"02-00"},"Други възнаграждения и плащания за персонала",null,{"$f":"SUM(L34:L38)","v":0},0,0,{"$f":"SUM(O34:O38)","v":0},0,0,0,0,""]
[23,{"$nulls":8},{"v":201,"d":"02-01"},"за нещатен персонал нает по трудови правоотношения ",{"$f":"M34+N34+O34","v":0},{"$nulls":6},{"$f":"P34+Q34+R34","v":0},""]
[24,{"$nulls":8},{"v":202,"d":"02-02"},"за персонала по извънтрудови правоотношения",{"$f":"M35+N35+O35","v":0},{"$nulls":6},{"$f":"P35+Q35+R35","v":0},""]
[25,{"$nulls":8},{"v":205,"d":"02-05"},"изплатени суми от СБКО за облекло и други на персонала, с характер на възнаграждение",{"$f":"M36+N36+O36","v":0},{"$nulls":6},{"$f":"P36+Q36+R36","v":0},""]
[26,{"$nulls":8},{"v":208,"d":"02-08"},"обезщетения за персонала, с характер на възнаграждение",{"$f":"M37+N37+O37","v":0},{"$nulls":6},{"$f":"P37+Q37+R37","v":0},""]
[27,{"$nulls":8},{"v":209,"d":"02-09"},"другиплащания и възнаграждения",{"$f":"M38+N38+O38","v":0},{"$nulls":6},{"$f":"P38+Q38+R38","v":0},""]
[28,{"$nulls":7},{"v":500,"d":"05-00"},"Задължителни осигурителни вноски от работодатели",null,{"$f":"SUM(L40:L46)","v":0},0,0,{"$f":"SUM(O40:O46)","v":0},0,0,0,0,""]
[29,{"$nulls":8},{"v":551,"d":"05-51"},"осигурителни вноски от работодатели за Държавното обществено осигуряване (ДОО)",{"$f":"M40+N40+O40","v":0},{"$nulls":6},{"$f":"P40+Q40+R40","v":0},""]
[30,{"$nulls":8},{"v":552,"d":"05-52"},"осигурителни вноски от работодатели за Учителския пенсионен фонд (УчПФ)",0,{"$nulls":6},0,""]
[31,{"$nulls":8},{"v":558,"d":"05-58"},"вноски по чл. 4б и 4в от КСО за сметка на осигурителя",{"$f":"M42+N42+O42","v":0},0,0,0,0,0,0,{"$f":"P42+Q42+R42","v":0},""]
[31,{"$nulls":8},{"v":560,"d":"05-60"},"здравно-осигурителни вноски от работодатели",0,{"$nulls":6},0,""]
[32,{"$nulls":8},{"v":580,"d":"05-80"},"вноски за допълнително задължително осигуряване от работодатели",0,{"$nulls":6},0,""]
[33,{"$nulls":8},{"v":588,"d":"05-88"},"коректив на вноски за ДЗПО за сумите по чл. 4б и 4в от КСО за сметка на осигурителя",{"$f":"M45+N45+O45","v":0},0,0,0,0,0,0,{"$f":"P45+Q45+R45","v":0},""]
[33,{"$nulls":8},{"v":590,"d":"05-90"},"задължителни вноски за чуждестранни пенсионни фондове и  схеми за сметка на осигурителя",0,{"$nulls":6},0,""]
[34,{"$nulls":7},{"v":800,"d":"08-00"},"Вноски за доброволно осигуряване  ",null,0,{"$nulls":6},0,""]
[35,{"$nulls":7},{"v":1000,"d":"10-00"},"Издръжка",null,{"$f":"SUM(L49:L65)","v":0},0,0,{"$f":"SUM(O49:O65)","v":0},0,0,0,0,""]
[36,{"$nulls":8},{"v":1011,"d":"10-11"},"Храна",{"$f":"M49+N49+O49","v":0},{"$nulls":6},{"$f":"P49+Q49+R49","v":0},""]
[37,{"$nulls":8},{"v":1012,"d":"10-12"},"Медикаменти",0,{"$nulls":6},0,""]
[38,{"$nulls":8},{"v":1013,"d":"10-13"},"Постелен инвентар и облекло",0,{"$nulls":6},0,""]
[39,{"$nulls":8},{"v":1014,"d":"10-14"},"Учебни и научно-изследователски разходи и книги за библиотеките",0,{"$nulls":6},0,""]
[40,{"$nulls":8},{"v":1015,"d":"10-15"},"материали",0,{"$nulls":6},0,""]
[41,{"$nulls":8},{"v":1016,"d":"10-16"},"вода, горива и енергия",0,{"$nulls":6},0,""]
[42,{"$nulls":8},{"v":1020,"d":"10-20"},"разходи за външни услуги",0,{"$nulls":6},0,""]
[43,{"$nulls":8},{"v":1030,"d":"10-30"},"Текущ ремонт",0,{"$nulls":6},0,""]
[44,{"$nulls":8},{"v":1051,"d":"10-51"},"командировки в страната",0,{"$nulls":6},0,""]
[45,{"$nulls":8},{"v":1052,"d":"10-52"},"краткосрочни командировки в чужбина",0,{"$nulls":6},0,""]
[46,{"$nulls":8},{"v":1053,"d":"10-53"},"дългосрочни командировки в чужбина",0,{"$nulls":6},0,""]
[47,{"$nulls":8},{"v":1062,"d":"10-62"},"разходи за застраховки",0,{"$nulls":6},0,""]
[48,{"$nulls":8},{"v":1063,"d":"10-63"},"такса ангажимент по заеми",0,{"$nulls":6},0,""]
[49,{"$nulls":8},{"v":1069,"d":"10-69"},"други финансови услуги",0,{"$nulls":6},0,""]
[50,{"$nulls":8},{"v":1091,"d":"10-91"},"други разходи за СБКО",0,{"$nulls":6},0,""]
[51,{"$nulls":8},{"v":1092,"d":"10-92"},"разходи за договорни санкции и неустойки, съдебни обезщетения и разноски",0,{"$nulls":6},0,""]
[52,{"$nulls":8},{"v":1098,"d":"10-98"},"други разходи, некласифицирани в другите параграфи и подпараграфи",0,{"$nulls":6},0,""]
[53,{"$nulls":7},{"v":1900,"d":"19-00"},"Платени данъци, такси и административни санкции",null,{"$f":"SUM(L67:L69)","v":0},0,0,{"$f":"SUM(O67:O69)","v":0},0,0,0,0,""]
[54,{"$nulls":8},{"v":1901,"d":"19-01"},"платени държавни данъци, такси, наказателни лихви и административни санкции",{"$f":"M67+N67+O67","v":0},{"$nulls":6},{"$f":"P67+Q67+R67","v":0},""]
[55,{"$nulls":8},{"v":1981,"d":"19-81"},"платени общински данъци, такси, наказателни лихви и административни санкции",{"$f":"M68+N68+O68","v":0},{"$nulls":6},{"$f":"P68+Q68+R68","v":0},""]
[56,{"$nulls":8},{"v":1991,"d":"19-91"},"платени данъци, такси, наказателни лихви и административни санкции в чужбина",{"$f":"M69+N69+O69","v":0},{"$nulls":6},{"$f":"P69+Q69+R69","v":0},""]
[57,{"$nulls":7},{"v":2100,"d":"21-00"},"Разходи за лихви по емисии на държавни (общински) ценни книжа",null,{"$f":"SUM(L71:L75)","v":0},0,0,{"$f":"SUM(O71:O75)","v":0},0,0,0,0,""]
[58,{"$nulls":8},{"v":2110,"d":"21-10"},"лихви по държавни (общински) ценни книжа",{"$f":"M71+N71+O71","v":0},{"$nulls":6},{"$f":"P71+Q71+R71","v":0},""]
[59,{"$nulls":8},{"v":2120,"d":"21-20"},"отстъпки по държавни (общински) ценни книжа",{"$f":"M72+N72+O72","v":0},{"$nulls":6},{"$f":"P72+Q72+R72","v":0},""]
[60,{"$nulls":8},{"v":2125,"d":"21-25"},"лихви и отстъпки по целеви емисии на държавни ценни книжа",{"$f":"M73+N73+O73","v":0},0,0,0,0,0,0,{"$f":"P73+Q73+R73","v":0},""]
[61,{"$nulls":8},{"v":2140,"d":"21-40"},"лихви по държавни ценни книжа, емитирани за структурната реформа ",{"$f":"M74+N74+O74","v":0},0,0,0,0,0,0,{"$f":"P74+Q74+R74","v":0},""]
[62,{"$nulls":8},{"v":2190,"d":"21-90"},"премии над номинала от емисии на държавни (общински) ценни книжа (-)",{"$f":"M75+N75+O75","v":0},{"$nulls":6},{"$f":"P75+Q75+R75","v":0},""]
[63,{"$nulls":7},{"v":2200,"d":"22-00"},"Разходи за лихви по заеми от страната",null,{"$f":"SUM(L77:L78)","v":0},0,0,{"$f":"SUM(O77:O78)","v":0},0,0,0,0,""]
[64,{"$nulls":8},{"v":2221,"d":"22-21"},"Разходи за лихви по заеми от банки в страната",{"$f":"M77+N77+O77","v":0},{"$nulls":6},{"$f":"P77+Q77+R77","v":0},""]
[65,{"$nulls":8},{"v":2224,"d":"22-24"},"Разходи за лихви по други заеми от страната",0,{"$nulls":6},0,""]
[66,{"$nulls":7},{"v":2500,"d":"25-00"},"Разходи за лихви по заеми от други държави",null,0,{"$nulls":6},0,""]
[67,{"$nulls":7},{"v":2600,"d":"26-00"},"Разходи за лихви по заеми от международни организации и институции",null,0,{"$nulls":6},0,""]
[68,{"$nulls":7},{"v":2700,"d":"27-00"},"Разходи за лихви по заеми от банки и други финансови институции от чужбина",null,0,{"$nulls":6},0,""]
[69,{"$nulls":7},{"v":2800,"d":"28-00"},"Разходи за лихви и отстъпки по облигации, емитирани и търгувани на международните капиталови пазари",null,0,{"$nulls":6},0,""]
[70,{"$nulls":7},{"v":2900,"d":"29-00"},"Други разходи за лихви",null,{"$f":"SUM(L84:L91)","v":0},{"$f":"SUM(M84:M91)","v":0},{"$f":"SUM(N84:N91)","v":0},0,0,0,0,0,""]
[71,{"$nulls":8},{"v":2910,"d":"29-10"},"Платени лихви по финансов лизинг и търговски кредит",{"$f":"M84+N84+O84","v":0},{"$nulls":6},{"$f":"P84+Q84+R84","v":0},""]
[71,{"$nulls":8},{"v":2920,"d":"29-20"},"Платени лихви по активирани гаранции по заеми от  банки в страната",{"$f":"M85+N85+O85","v":0},{"$nulls":6},{"$f":"P85+Q85+R85","v":0},""]
[72,{"$nulls":8},{"v":2969,"d":"29-69"},"Платени лихви по активирани гаранции по заеми от международни организации и институции",0,{"$nulls":6},0,""]
[73,{"$nulls":8},{"v":2970,"d":"29-70"},"Платени лихви по активирани гаранции по заеми от банки и финансови институции от чужбина",0,{"$nulls":6},0,""]
[74,{"$nulls":8},{"v":2989,"d":"29-89"},"Възстановени суми по платени лихви по активирани гаранции (-)",0,{"$nulls":6},0,""]
[75,{"$nulls":8},{"v":2990,"d":"29-90"},"Платени лихви по активирани гаранции по заеми от  банки в страната",{"$f":"M89+N89+O89","v":0},{"$nulls":6},{"$f":"P89+Q89+R89","v":0},""]
[75,{"$nulls":8},{"v":2991,"d":"29-91"},"Други разходи за лихви към  местни лица",0,{"$nulls":6},0,""]
[76,{"$nulls":8},{"v":2992,"d":"29-92"},"Други разходи за лихви към чуждестранни лица",0,{"$nulls":6},0,""]
[77,{"$nulls":7},{"v":3300,"d":"33-00"},"Вноска в общия бюджет на Европейския съюз",null,{"$f":"SUM(L93:L97)","v":0},0,0,0,0,0,0,0,""]
[78,{"$nulls":8},{"v":3301,"d":"33-01"},"ресурс на база брутен национален доход",{"$f":"M93+N93+O93","v":0},0,0,0,0,0,0,{"$f":"P93+Q93+R93","v":0},""]
[79,{"$nulls":8},{"v":3302,"d":"33-02"},"ресурс на база данък върху добавената стойност",0,0,0,0,0,0,0,0,""]
[80,{"$nulls":8},{"v":3303,"d":"33-03"},"корекция за Обединеното кралство",0,0,0,0,0,0,0,0,""]
[81,{"$nulls":8},{"v":3304,"d":"33-04"},"традиционни собствени ресурси - мита",0,0,0,0,0,0,0,0,""]
[83,{"$nulls":8},{"v":3306,"d":"33-06"},"участие във финансирането на брутното намаление за Нидерландия, Швеция, Дания и Австрия",0,0,0,0,0,0,0,0,""]
[84,{"$nulls":7},{"v":3900,"d":"39-00"},"Здравно-осигурителни плащания",null,0,0,0,0,0,0,0,0,{"$f":"(IF($E98<>0,$M$2,IF($L98<>0,$M$2,\"\")))","v":""}]
[85,{"$nulls":7},{"v":4000,"d":"40-00"},"Стипендии",null,0,{"$nulls":6},0,""]
[86,{"$nulls":7},{"v":4100,"d":"41-00"},"Пенсии",null,0,0,0,0,0,0,0,0,""]
[87,{"$nulls":7},{"v":4200,"d":"42-00"},"Текущи трансфери, обезщетения и помощи за домакинствата",null,{"$f":"SUM(L102:L107)","v":0},0,0,{"$f":"SUM(O102:O107)","v":0},0,0,0,0,""]
[88,{"$nulls":8},{"v":4201,"d":"42-01"},"обезщетения и помощи по социалното осигуряване",{"$f":"M102+N102+O102","v":0},{"$nulls":6},{"$f":"P102+Q102+R102","v":0},""]
[89,{"$nulls":8},{"v":4202,"d":"42-02"},"обезщетения и помощи по социалното подпомагане",0,{"$nulls":6},0,""]
[90,{"$nulls":8},{"v":4214,"d":"42-14"},"обезщетения и помощи по решение на общинския съвет",0,{"$nulls":6},0,""]
[91,{"$nulls":8},{"v":4217,"d":"42-17"},"текущи трансфери за домакинства от средства на Европейския съюз",0,{"$nulls":6},0,""]
[92,{"$nulls":8},{"v":4218,"d":"42-18"},"текущи трансфери за домакинства по други международни програми и споразумения",0,{"$nulls":6},0,""]
[93,{"$nulls":8},{"v":4219,"d":"42-19"},"други текущи трансфери за домакинствата",0,{"$nulls":6},0,""]
[94,{"$nulls":7},{"v":4300,"d":"43-00"},"Субсидии и други текущи трансфери за нефинансови предприятия",null,{"$f":"SUM(L109:L111)","v":0},0,0,{"$f":"SUM(O109:O111)","v":0},0,0,0,0,""]
[95,{"$nulls":8},{"v":4301,"d":"43-01"},"за текуща дейност",{"$f":"M109+N109+O109","v":0},{"$nulls":6},{"$f":"P109+Q109+R109","v":0},""]
[96,{"$nulls":8},{"v":4302,"d":"43-02"},"за осъществяване на болнична помощ ",0,{"$nulls":6},0,""]
[97,{"$nulls":8},{"v":4309,"d":"43-09"},"други субсидии и плащания",0,{"$nulls":6},0,""]
[98,{"$nulls":7},{"v":4400,"d":"44-00"},"Субсидии и други текущи трансфери за финансови институции",null,0,{"$nulls":6},0,""]
[99,{"$nulls":7},{"v":4500,"d":"45-00"},"Субсидии и други текущи трансфери за юридически лица с нестопанска цел",null,0,{"$nulls":6},0,""]
[100,{"$nulls":7},{"v":4600,"d":"46-00"},"Разходи за членски внос и участие в нетърговски организации и дейности",null,0,{"$nulls":6},0,""]
[101,{"$nulls":7},{"v":4900,"d":"49-00"},"Предоставени текущи и капиталови трансфери за чужбина",null,{"$f":"+L116+L117","v":0},0,0,{"$f":"+O116+O117","v":0},0,0,0,0,""]
[102,{"$nulls":8},{"v":4901,"d":"49-01"},"текущи трансфери за чужбина",{"$f":"M116+N116+O116","v":0},{"$nulls":6},{"$f":"P116+Q116+R116","v":0},""]
[103,{"$nulls":8},{"v":4902,"d":"49-02"},"капиталови трансфери за чужбина",{"$f":"M117+N117+O117","v":0},{"$nulls":6},{"$f":"P117+Q117+R117","v":0},""]
[104,{"$nulls":7},{"v":5100,"d":"51-00"},"Основен ремонт на дълготрайни материални активи",null,{"$f":"M118+N118+O118","v":0},{"$nulls":6},{"$f":"P118+Q118+R118","v":0},""]
[105,{"$nulls":7},{"v":5200,"d":"52-00"},"Придобиване на дълготрайни материални активи",null,{"$f":"SUM(L120:L126)","v":0},0,0,{"$f":"SUM(O120:O126)","v":0},0,0,0,0,""]
[106,{"$nulls":8},{"v":5201,"d":"52-01"},"придобиване на компютри и хардуер",{"$f":"M120+N120+O120","v":0},{"$nulls":6},{"$f":"P120+Q120+R120","v":0},""]
[107,{"$nulls":8},{"v":5202,"d":"52-02"},"придобиване на сгради",0,{"$nulls":6},0,""]
[108,{"$nulls":8},{"v":5203,"d":"52-03"},"придобиване на друго оборудване, машини и съоръжения",0,{"$nulls":6},0,""]
[109,{"$nulls":8},{"v":5204,"d":"52-04"},"придобиване на транспортни средства",0,{"$nulls":6},0,""]
[110,{"$nulls":8},{"v":5205,"d":"52-05"},"придобиване на стопански инвентар",0,{"$nulls":6},0,""]
[111,{"$nulls":8},{"v":5206,"d":"52-06"},"изграждане на инфраструктурни обекти",0,{"$nulls":6},0,""]
[112,{"$nulls":8},{"v":5219,"d":"52-19"},"придобиване на други ДМА",0,{"$nulls":6},0,""]
[113,{"$nulls":7},{"v":5300,"d":"53-00"},"Придобиване на нематериални дълготрайни активи",null,{"$f":"SUM(L128:L129)","v":0},0,0,{"$f":"SUM(O128:O129)","v":0},0,0,0,0,""]
[114,{"$nulls":8},{"v":5301,"d":"53-01"},"придобиване на програмни продукти и лицензи за програмни продукти",{"$f":"M128+N128+O128","v":0},{"$nulls":6},{"$f":"P128+Q128+R128","v":0},""]
[115,{"$nulls":8},{"v":5309,"d":"53-09"},"придобиване на други нематериални дълготрайни активи",{"$f":"M129+N129+O129","v":0},{"$nulls":6},{"$f":"P129+Q129+R129","v":0},""]
[116,{"$nulls":7},{"v":5400,"d":"54-00"},"Придобиване на земя",null,{"$f":"M130+N130+O130","v":0},{"$nulls":6},{"$f":"P130+Q130+R130","v":0},""]
[117,{"$nulls":7},{"v":5500,"d":"55-00"},"Капиталови трансфери",null,{"$f":"SUM(L132:L135)","v":0},0,0,{"$f":"SUM(O132:O135)","v":0},0,0,0,0,""]
[118,{"$nulls":8},{"v":5501,"d":"55-01"},"капиталови трансфери за нефинансови предприятия",{"$f":"M132+N132+O132","v":0},{"$nulls":6},{"$f":"P132+Q132+R132","v":0},""]
[119,{"$nulls":8},{"v":5502,"d":"55-02"},"капиталови трансфери за финансови институции",{"$f":"M133+N133+O133","v":0},{"$nulls":6},{"$f":"P133+Q133+R133","v":0},""]
[120,{"$nulls":8},{"v":5503,"d":"55-03"},"капиталови трансфери за организации с нестопанска цел",{"$f":"M134+N134+O134","v":0},{"$nulls":6},{"$f":"P134+Q134+R134","v":0},""]
[121,{"$nulls":8},{"v":5504,"d":"55-04"},"капиталови трансфери за домакинствата",{"$f":"M135+N135+O135","v":0},{"$nulls":6},{"$f":"P135+Q135+R135","v":0},""]
[122,{"$nulls":7},{"v":5700,"d":"57-00"},"Прираст на държавния резерв и изкупуване на земеделска продукция (включва и § 40-71)",null,{"$f":"SUM(L137:L139)","v":0},0,0,0,0,0,0,{"$f":"SUM(S137:S139)","v":0},""]
[123,{"$nulls":8},{"v":5701,"d":"57-01"},"плащания за попълване на държавния резерв",{"$f":"M137+N137+O137","v":0},0,0,0,0,0,0,{"$f":"P137+Q137+R137","v":0},""]
[124,{"$nulls":8},{"v":5702,"d":"57-02"},"плащания за изкупуване на земеделска продукция",{"$f":"M138+N138+O138","v":0},0,0,0,0,0,0,{"$f":"P138+Q138+R138","v":0},""]
[125,{"$nulls":8},{"v":4071,"d":"40-71"},"постъпления от продажба на държавния резерв (-)",{"$f":"M139+N139+O139","v":0},0,0,0,0,0,0,{"$f":"P139+Q139+R139","v":0},""]
[126,{"$nulls":8},"Резерв за непредвидени и неотложни разходи",{"$nulls":9},""]
[127,{"$nulls":7},{"v":98,"d":"00-98"},"Резерв за непредвидени и неотложни разходи",null,{"$f":"M141+N141+O141","v":0},{"$nulls":3},0,0,0,{"$f":"P141+Q141+R141","v":0},""]
[128,{"$nulls":18},""]
[129,{"$nulls":18},""]
[130,{"$nulls":18},""]
[131,{"$nulls":8},"99-99",{"$f":"+I145","v":{"v":0,"d":"II. ОБЩО РАЗХОДИ ЗА ДЕЙНОСТ 0000"}},{"$f":"SUM(L30,L33,L39,L47,L48,L66,L70,L76,L79,L80,L81,L82,L83,L92,L98,L99,L100,L101,L108,L112,L113,L114,L115,L118,L119,L127,L130,L131,L136)+L141","v":0},0,0,0,0,0,0,0,{"$f":"(IF($E145<>0,$M$2,IF($L145<>0,$M$2,\"\")))","v":""},{"$f":"LEFT(J27,1)","v":"0"}]
[132,{"$nulls":7},"край на дейност",{"$nulls":10},{"$f":"(IF($E145<>0,$M$2,IF($L145<>0,$M$2,\"\")))","v":""}]
[169,{"$nulls":18},{"$f":"(IF($E145<>0,$M$2,IF($L145<>0,$M$2,\"\")))","v":""}]
[{"$nulls":19},{"$f":"(IF(L143<>0,$G$2,IF(S143<>0,$G$2,\"\")))","v":""}]
[{"$nulls":19},{"$f":"(IF(L144<>0,$G$2,IF(S144<>0,$G$2,\"\")))","v":""}]
[{"$nulls":19},{"$f":"(IF(L145<>0,$G$2,IF(S145<>0,$G$2,\"\")))","v":""}]
[{"$nulls":19},{"$f":"(IF(L145<>0,$G$2,IF(S145<>0,$G$2,\"\")))","v":""}]
[{"$nulls":19},{"$f":"(IF(L145<>0,$G$2,IF(S145<>0,$G$2,\"\")))","v":""}]
[{"$nulls":19},{"$f":"(IF(L145<>0,$G$2,IF(S145<>0,$G$2,\"\")))","v":""}]
[{"$nulls":19},{"$f":"(IF(L145<>0,$G$2,IF(S145<>0,$G$2,\"\")))","v":""}]